(1,1'-Biphenyl)-2,2'-dicarboxaldehyde

Lee's RI, non-polar column, custom temperature program

View large format table.

Column type Active phase I Reference Comment
CapillaryDB-5311.5Helmig and Harger, 1994He; Column length: 60. m; Column diameter: 0.248 mm; Program: 50C (2min) => 25C/min => 150C => 4C/min => 325C

References

Helmig and Harger, 1994
Helmig, D.; Harger, W.P., OH radical-initiated gas-phase reaction products of phenanthrene, Sci. Total Environ., 1994, 148, 1, 11-21, https://doi.org/10.1016/0048-9697(94)90368-9 . [all data]