Methanimidamide, N'-(3-methoxyphenyl)-N,N-dimethyl-
- Formula: C10H14N2O
- Molecular weight: 178.2310
- IUPAC Standard InChIKey: ZRULGOONNZXEHT-UHFFFAOYSA-N
- CAS Registry Number: 1202-42-2
- Chemical structure:
View 3d structure (requires JavaScript / HTML 5) - Other names: Formamidine, N'-(m-methoxyphenyl)-N,N-dimethyl-; Formamidine, 3,3-dimethyl-1-(3-methoxyphenyl); N'-(3-Methoxy-phenyl)-N,N-dimethyl-formamidine

Kovats' RI, non-polar column, isothermal

Column type | Active phase | Temperature (C) | I | Reference | Comment |
---|---|---|---|---|---|
Packed | SE-30 | 240. | 1641. | Osek, Oszczapowicz, et al., 1986 | N2, Chromosorb W AW (60-80 mesh); Column length: 3. m |
Packed | SE-30 | 240. | 1641. | Oszczapowicz, Osek, et al., 1984 | N2, Chromosorb W AW; Column length: 3. m |

Gas phase ion energetics data

Data compiled by: Sharon G. Lias, Rhoda D. Levin, and Sherif A. Kafafi
Appearance energy determinations
Ion | AE (eV) | Other Products | Method | Reference | Comment |
---|---|---|---|---|---|
C10H13N2O+ | 9.2 ± 0.1 | H | EI | Kuschel and Grutzmacher, 1974 | |
C10H14N2O+ | 7.2 ± 0.1 | ? | EI | Kuschel and Grutzmacher, 1974 |

References

Osek, Oszczapowicz, et al., 1986
Osek, J.; Oszczapowicz, J.; Drzewinski, W.,
Prediction of Retention Indices of N1,N1-Dialkylformamidines on a Non-Polar Column,
J. Chromatogr., 1986, 351, 177-182, https://doi.org/10.1016/S0021-9673(01)83486-5
. [all data]
Oszczapowicz, Osek, et al., 1984
Oszczapowicz, J.; Osek, J.; Dolecka, E.,
Retention indices of dimethylformamidines, dimethylacetamidines and tetramethylguanidines on a non-polar column,
J. Chromatogr., 1984, 315, 95-100, https://doi.org/10.1016/S0021-9673(01)90727-7
. [all data]