1H-Indole, 2,3-dihydro-1,3,3-trimethyl-2-methylene-

Gas phase ion energetics data

Data compiled by: Sharon G. Lias and Joel F. Liebman

Ionization energy determinations

IE (eV) Method Reference
6.98PEQuast, Ach, et al., 1993

References

Quast, Ach, et al., 1993
Quast, H.; Ach, M.; Kindermann, M.K.; Rademacher, P.; Schindler, M., Synthese, NMR-Spektren und Photoelektronen-Spektren von cyclischen Keten-N,X-acetalen (2-Alkyliden-N-heterocyclen), Chem. Ber., 1993, 126, 503. [all data]