2-Nonynoic acid, methyl ester

Normal alkane RI, non-polar column, temperature ramp

View large format table.

Column type Active phase I Reference Comment
CapillaryBPX-51310.Bieri and Marriott, 200830. m/0.25 mm/0.25 μm, Hydrogen, 3. K/min; Tstart: 100. C; Tend: 999. C
CapillaryBPX-51310.Bieri and Marriott, 200830. m/0.25 mm/0.25 μm, Hydrogen, 3. K/min; Tstart: 60. C; Tend: 999. C
CapillaryBPX-51311.Bieri and Marriott, 200830. m/0.25 mm/0.25 μm, Hydrogen, 3. K/min; Tstart: 60. C; Tend: 999. C
CapillaryBPX-51312.Bieri and Marriott, 200830. m/0.25 mm/0.25 μm, Hydrogen, 3. K/min; Tstart: 60. C; Tend: 999. C
CapillaryBPX-51321.Bieri and Marriott, 200830. m/0.25 mm/0.25 μm, Hydrogen, 3. K/min; Tstart: 60. C; Tend: 999. C
CapillaryBPX-51311.Bieri and Marriott, 200830. m/0.25 mm/0.25 μm, Hydrogen, 5. K/min; Tstart: 60. C; Tend: 999. C

References

Bieri and Marriott, 2008
Bieri, S.; Marriott, P.J., Dual-injection system with multiply injections for determining sidimentional retention indexes in comprehensive two-dimensional gas chromatography, Anal. Chem., 2008, 80, 3, 760-768, https://doi.org/10.1021/ac071367q . [all data]