2,4-Hexadien-1-ol
- Formula: C6H10O
- Molecular weight: 98.1430
- IUPAC Standard InChIKey: MEIRRNXMZYDVDW-UHFFFAOYSA-N
- CAS Registry Number: 111-28-4
- Chemical structure:
View 3d structure (requires JavaScript / HTML 5) - Stereoisomers:
- Other names: n-Hexa-2,4-dien-1-ol; Hexacose; Hexakose; Sorbic alcohol; Sorbinic alcohol; Sorbyl alcohol; 1-Hydroxy-2,4-hexadiene; 2,4-Hexadiene-1-ol; 2,4-Hexadienol; (E,E)-2,4-Hexadienol; hexa-2,4-dien-1-ol

Van Den Dool and Kratz RI, non-polar column, temperature ramp

Column type | Active phase | I | Reference | Comment |
---|---|---|---|---|
Capillary | SPB-1 | 882. | Chisholm and Samuels, 1992 | 15. m/0.32 mm/0.25 μm, He, 35. C @ 3. min, 6. K/min; Tend: 250. C |
Capillary | SPB-1 | 891. | Chisholm and Samuels, 1992 | 15. m/0.32 mm/0.25 μm, He, 35. C @ 3. min, 6. K/min; Tend: 250. C |

Normal alkane RI, non-polar column, temperature ramp

Column type | Active phase | I | Reference | Comment |
---|---|---|---|---|
Capillary | HP-5 MS | 916. | Phungpanya, Thongpoon, et al., 2012 | 30. m/0.25 mm/0.25 μm, Helium, 2. K/min; Tstart: 50. C; Tend: 180. C |

Normal alkane RI, polar column, temperature ramp

Column type | Active phase | I | Reference | Comment |
---|---|---|---|---|
Capillary | DB-Wax | 1523. | Lee and Shibamoto, 2000 | 30. m/0.25 mm/0.25 μm, He, 3. K/min, 180. C @ 40. min; Tstart: 50. C |
Capillary | DB-Wax | 1588. | Umano, Nakahara, et al., 1999 | 60. m/0.25 mm/0.25 μm, He, 40. C @ 2. min, 2. K/min; Tend: 200. C |
Capillary | DB-Wax | 1570. | Umano, Nakahara, et al., 1999 | 60. m/0.25 mm/0.25 μm, He, 40. C @ 2. min, 2. K/min; Tend: 200. C |

Phase change data

Data compiled by: Thermodynamics Research Center, NIST Boulder Laboratories, Chris Muzny director

Quantity Value Units Method Reference Comment
Tfus302.KN/AWoods, Bolgiano, et al., 1955Uncertainty assigned by TRC = 2. K

In addition to the Thermodynamics Research Center (TRC) data available from this site, much more physical and chemical property data is available from the following TRC products:

References

Chisholm and Samuels, 1992
Chisholm, M.G.; Samuels, J.M.,
Determination of the impact of the metabolites of sorbic acid on the ordor of a spoiled red wine,
J. Agric. Food Chem., 1992, 40, 4, 630-633, https://doi.org/10.1021/jf00016a021
. [all data]
Phungpanya, Thongpoon, et al., 2012
Phungpanya, C.; Thongpoon, C.; Pripdeevech, P.; Machan, T.,
Analysis of aroma volatiles from fresh leaves of Plectranthus amboinicus using solid phase microextraction (SPME) technique, Pure and Applied Chemistry International Conference 2012 (PACCON 2012), 2012, 16701672. [all data]
Lee and Shibamoto, 2000
Lee, K.-G.; Shibamoto, T.,
Antioxidant properties of aroma compounds isolated from soybeans and mung beans,
J. Agric. Food Chem., 2000, 48, 9, 4290-4293, https://doi.org/10.1021/jf000442u
. [all data]
Umano, Nakahara, et al., 1999
Umano, K.; Nakahara, K.; Shoji, A.; Shibamoto, T.,
Aroma chemicals isolated and identified from leaves of aloe arborescens Mill. Var. natalensis Berger,
J. Agric. Food Chem., 1999, 47, 9, 3702-3705, https://doi.org/10.1021/jf990116i
. [all data]