2,3,4-Trihydroxybenzoic acid, 4TMS derivative
- Formula: C19H38O5Si4
- Molecular weight: 458.8440
- IUPAC Standard InChIKey: GWWLYEXBIBGVGY-UHFFFAOYSA-N
- CAS Registry Number: 107966-20-1
- Chemical structure:
View 3d structure (requires JavaScript / HTML 5) - Other names: 2,3,4-Trihydroxybenzoic acid, tetrakis(trimethylsilyl)-; 2,3,4-Trihydroxybenzoic acid, tetra-TMS; Benzoic acid, 2,3,4-tris-(trimethylsilyloxy), trimethylsilyl ester

Van Den Dool and Kratz RI, non-polar column, temperature ramp

Column type | Active phase | I | Reference | Comment |
---|---|---|---|---|
Packed | OV-1 | 1932. | Mattsson and Petersson, 1977 | N2, Supelcoport, 4. K/min; Column length: 2. m; Tstart: 80. C; Tend: 240. C |

References

Mattsson and Petersson, 1977
Mattsson, M.; Petersson, G.,
Reference GLC Data for the Analysis of Phenolic Compounds as Trimethylsilyl Derivatives,
J. Chromatogr. Sci., 1977, 15, 12, 546-554, https://doi.org/10.1093/chromsci/15.12.546
. [all data]