1,3,2-Diazaphosphol-4-ene, 2-ethyl-1,3-dibutyl-4,5-dimethyl-

Gas phase ion energetics data

Data compiled by: Sharon G. Lias and Joel F. Liebman

Ionization energy determinations

IE (eV) Method Reference Comment
6.60PEZverev, Gryaznova, et al., 1991Vertical value

References

Zverev, Gryaznova, et al., 1991
Zverev, V.V.; Gryaznova, T.V.; Kibardin, A.M., Photoelectron spectra and electronic structure of organophosphorus compounds. XIV. 1,3,2-Diazaphospholenes, J. Gen. Chem. USSR, 1991, 61, 2690. [all data]