Cobalt, [(1,2,3,4-η)-2,4-bis(1,1-dimethylethyl)-1,3-diphosphete](η5-2,4-cyclopentadien-1-yl)-

Gas phase ion energetics data

Data compiled by: Sharon G. Lias and Joel F. Liebman

Ionization energy determinations

IE (eV) Method Reference Comment
7.4PEGleiter, Hyla-Kryspin, et al., 1992Vertical value

References

Gleiter, Hyla-Kryspin, et al., 1992
Gleiter, R.; Hyla-Kryspin, I.; Binger, P.; Regitz, M., Electronic structure of 2,4-di-tert-butyl-η<4>-1,3-diphosphacyclobutadiene complexes with Fe(CO)3 and .eta<5>-C5H5Co. Photoelectron spectra and molecular orbital calculations, Organometallics, 1992, 11, 177. [all data]