Cyclopropanecarbonitrile, 1,2-diphenyl-

Gas phase ion energetics data

Data compiled by: Sharon G. Lias, Rhoda D. Levin, and Sherif A. Kafafi

Ionization energy determinations

IE (eV) Method Reference
8.80 ± 0.08EILageot, 1971

References

Lageot, 1971
Lageot, C., Potentiel d'ionisation, courbes d'efficacite d'ionisation differentielle, localisation de la charge de 9 cyclopropanes, Org. Mass Spectrom., 1971, 5, 845. [all data]