1,1,3,3-Tetramethyl-1,3-bis[(3Z)-non-3-en-1-yloxy]disiloxane
- Formula: C22H46O3Si2
- Molecular weight: 414.7698
- IUPAC Standard InChIKey: YQQIEVZNFMNABV-IQRFGFHNSA-N
- Chemical structure:

Van Den Dool and Kratz RI, non-polar column, custom temperature program

Column type | Active phase | I | Reference | Comment |
---|---|---|---|---|
Capillary | VF-5MS | 2133.9 | Tret'yakov, 2008 | 30. m/0.25 mm/0.25 μm, He; Program: Multi-step temperature program; T(initial)=60C; T(final)=270C |

References

Tret'yakov, 2008
Tret'yakov, K.V.,
Retention Data. NIST Mass Spectrometry Data Center., NIST Mass Spectrometry Data Center, 2008. [all data]