3-Hydroxy-4-methoxybenzyl alcohol, 2TMS derivative
- Formula: C14H26O3Si2
- Molecular weight: 298.5254
- IUPAC Standard InChIKey: IJGZVNYCFGLMLG-UHFFFAOYSA-N
- Chemical structure:
View 3d structure (requires JavaScript / HTML 5) - Other names: 3-Hydroxy-4-methoxybenzyl alcohol, bis(trimethylsilyl) ether; Benzenemethanol, 3-hydroxy-4-methoxy, bis-TMS; Isovanillic alcohol, TMS

Van Den Dool and Kratz RI, non-polar column, temperature ramp

Column type | Active phase | I | Reference | Comment |
---|---|---|---|---|
Packed | OV-1 | 1626. | Mattsson and Petersson, 1977 | N2, Supelcoport, 4. K/min; Column length: 2. m; Tstart: 80. C; Tend: 240. C |
Packed | SE-30 | 1627. | Lhuguenot, Maume, et al., 1971 | N2, Gas Chrom P (120-140 mesh), 1. K/min; Column length: 3. m; Tstart: 100. C; Tend: 180. C |

Van Den Dool and Kratz RI, non-polar column, custom temperature program

Column type | Active phase | I | Reference | Comment |
---|---|---|---|---|
Capillary | VF-5MS | 1624.1 | Tret'yakov, 2007 | 30. m/0.25 mm/0.25 μm, He; Program: Multi-step temperature program; T(initial)=60C; T(final)=270C |

References

Mattsson and Petersson, 1977
Mattsson, M.; Petersson, G.,
Reference GLC Data for the Analysis of Phenolic Compounds as Trimethylsilyl Derivatives,
J. Chromatogr. Sci., 1977, 15, 12, 546-554, https://doi.org/10.1093/chromsci/15.12.546
. [all data]
Lhuguenot, Maume, et al., 1971
Lhuguenot, J.C.; Maume, B.F.; Baron, C.,
Gas Chromatographic and Mass Spectrometric Study of Vanillin Related Compounds,
Chromatographia, 1971, 4, 5, 204-208, https://doi.org/10.1007/BF02281053
. [all data]
Tret'yakov, 2007
Tret'yakov, K.V.,
Retention Data. NIST Mass Spectrometry Data Center., NIST Mass Spectrometry Data Center, 2007. [all data]