Pyrimidine, 5-amino-4,6-dihydroxy, TMS
- Formula: C13H29N3O2Si3
- Molecular weight: 343.6448
- IUPAC Standard InChIKey: WTVIZDZHYZBTAK-UHFFFAOYSA-N
- Chemical structure:
View 3d structure (requires JavaScript / HTML 5) - Permanent link for this species. Use this link for bookmarking this species for future reference.

Kovats' RI, non-polar column, custom temperature program

Column type | Active phase | I | Reference | Comment |
---|---|---|---|---|
Packed | OV-1 | 1647. | Yamaji, Kimura, et al., 1978 | Gas Chrom Q; Column length: 1. m; Program: not specified |

References

Yamaji, Kimura, et al., 1978
Yamaji, A.; Kimura, S.; Kawasaki, H.; Yuki, H.,
Gas chromatographic analysis of pyrimidine and purine bases by retention indices,
Yakugaku Zasshi, 1978, 98, 1, 1536-1541. [all data]