exo-Tricyclo[6,2,1,0(2,6)]decan-8-α-ol

Kovats' RI, non-polar column, isothermal

Data compiled by: NIST Mass Spectrometry Data Center, William E. Wallace, director

Column type Capillary
Active phase OV-1
Column length (m) 50.
Carrier gas
Substrate
Column diameter (mm) 0.30
Phase thickness (μm)
Temperature (C) 140.
I 1296.
ReferenceStopp, Engewald, et al., 1978
Comment MSDC-RI

References

Stopp, Engewald, et al., 1978
Stopp, I.; Engewald, W.; Kühn, H.; Welsch, Th., Molekülstruktur und retentionsverhalten. VIII. Zum gaschromatographischen retentionsverhalten von dicyclopentadienderivaten, J. Chromatogr., 1978, 147, 21-30, https://doi.org/10.1016/S0021-9673(00)85113-4 . [all data]