(5Z,8Z,11Z)-tetradecatrien-2-one

Normal alkane RI, polar column, temperature ramp

View large format table.

Column type Active phase I Reference Comment
CapillaryPEG-20M2014.Kobayashi, Kubota, et al., 1989He, 60. C @ 4. min, 2. K/min; Column length: 50. m; Column diameter: 0.25 mm; Tend: 180. C

References

Kobayashi, Kubota, et al., 1989
Kobayashi, A.; Kubota, K.; Iwamoto, M.; Tamura, H., Syntheses and sensory characterization of 5,8,11-tetradecatrien-2-one isomers, J. Agric. Food Chem., 1989, 37, 1, 151-154, https://doi.org/10.1021/jf00085a035 . [all data]