1,2-dimethyladamantane

Kovats' RI, non-polar column, isothermal

View large format table.

Column type Active phase Temperature (C) I Reference Comment
CapillarySE-30145.1236.Bogoslovsky, Anvaer, et al., 1978
CapillarySE-30145.1236.Burkhard, Vais, et al., 1969N2; Column length: 50. m; Column diameter: 0.27 mm
CapillarySE-30160.1249.Burkhard, Vais, et al., 1969N2; Column length: 50. m; Column diameter: 0.27 mm
CapillarySE-30175.1264.Burkhard, Vais, et al., 1969N2; Column length: 50. m; Column diameter: 0.27 mm
CapillarySE-30190.1275.Burkhard, Vais, et al., 1969N2; Column length: 50. m; Column diameter: 0.27 mm

Kovats' RI, non-polar column, temperature ramp

View large format table.

Column type Active phase I Reference Comment
CapillaryHP-5MS1208.Yang, Wang, et al., 200630. m/0.25 mm/0.25 μm, 50. C @ 2. min, 6. K/min; Tend: 300. C

Kovats' RI, polar column, isothermal

View large format table.

Column type Active phase Temperature (C) I Reference Comment
CapillaryCarbowax 20M145.1424.Burkhard, Vais, et al., 1969N2; Column length: 50. m; Column diameter: 0.27 mm
CapillaryCarbowax 20M160.1449.Burkhard, Vais, et al., 1969N2; Column length: 50. m; Column diameter: 0.27 mm
CapillaryCarbowax 20M175.1468.Burkhard, Vais, et al., 1969N2; Column length: 50. m; Column diameter: 0.27 mm

References

Bogoslovsky, Anvaer, et al., 1978
Bogoslovsky, Yu.N.; Anvaer, B.I.; Vigdergauz, M.S., Chromatographic constants in gas chromatography (in Russian), Standards Publ. House, Moscow, 1978, 192. [all data]

Burkhard, Vais, et al., 1969
Burkhard, J.; Vais, J.; Vodicka, L.; Landa, S., Adamantane and its derivatives. XVI. The gas chromatographic characterization of adamantane derivatives, J. Chromatogr., 1969, 42, 207-218, https://doi.org/10.1016/S0021-9673(01)80617-8 . [all data]

Yang, Wang, et al., 2006
Yang, C.; Wang, Z.D.; Hollebone, B.P.; Peng, X.; Fingas, M.; Landriault, M., GC/MS Quantitation of diamondoid compounds in crude oils and petroleum products, Environmental Forensics, 2006, 7, 4, 377-390, https://doi.org/10.1080/15275920600996396 . [all data]