5,5-Dimethyl-2-phenyl-4-propionyl-1,3,4-oxadiazoline
- Formula: C13H16N2O2
- Molecular weight: 232.2783
- IUPAC Standard InChIKey: JJIXJTDOKAFPGX-UHFFFAOYSA-N
- Chemical structure:
View 3d structure (requires JavaScript / HTML 5) - Permanent link for this species. Use this link for bookmarking this species for future reference.

Normal alkane RI, non-polar column, temperature ramp

Column type | Active phase | I | Reference | Comment |
---|---|---|---|---|
Packed | SE-30 | 1630. | Zenkevich and Yandovskij, 1984 | He, Chromosorb W AW DMCS (80-100 mesh), 5. K/min; Column length: 1.8 m; Tstart: 70. C |

References

Zenkevich and Yandovskij, 1984
Zenkevich, I.G.; Yandovskij, V.N.,
Chromato-Mass-Spectrometric Characterization of Substituted 4-Acyl-1,3,4-oxadiazolines,
Khim. Geterotsikl. Soedin., 1984, 5, 623-631. [all data]