2-Pentyne, 4,4-dimethyl-
- Formula: C7H12
- Molecular weight: 96.1702
- IUPAC Standard InChIKey: FOALCTWKQSWRST-UHFFFAOYSA-N
- CAS Registry Number: 999-78-0
- Chemical structure:
View 3d structure (requires JavaScript / HTML 5) - Other names: 4,4-Dimethyl-2-pentyne; Propyne, 1-tert-butyl-; (tert-C4H9)C≡CCH3

Gas phase thermochemistry data

Data compiled by: Glushko Thermocenter, Russian Academy of Sciences, Moscow
Constant pressure heat capacity of gas
Cp,gas (J/mol*K) | Temperature (K) | Reference | Comment |
---|---|---|---|
46.14 | 50. | Thermodynamics Research Center, 1997 | p=1 bar. |
70.95 | 100. | ||
93.79 | 150. | ||
113.35 | 200. | ||
141.03 | 273.15 | ||
150.56 | 298.15 | ||
151.26 | 300. | ||
187.97 | 400. | ||
220.16 | 500. | ||
247.40 | 600. | ||
270.57 | 700. | ||
290.49 | 800. | ||
307.73 | 900. | ||
322.68 | 1000. | ||
335.6 | 1100. | ||
346.9 | 1200. | ||
356.6 | 1300. | ||
365.1 | 1400. | ||
372.4 | 1500. |

Phase change data

Data compiled as indicated in comments:
BS - Robert L. Brown and Stephen E. Stein
TRC - Thermodynamics Research Center, NIST Boulder Laboratories, Chris Muzny director
Quantity | Value | Units | Method | Reference | Comment |
---|---|---|---|---|---|
Tboil | 356. | K | N/A | Farchan Laboratories, 1990 | BS |
Tboil | 356.15 | K | N/A | Miller, Greenlee, et al., 1954 | Uncertainty assigned by TRC = 0.5 K; TRC |
Tboil | 355.65 | K | N/A | Zakharova, 1950 | Uncertainty assigned by TRC = 2. K; TRC |
Tboil | 356.1 | K | N/A | De Graef, 1925 | Uncertainty assigned by TRC = 1.5 K; TRC |
Quantity | Value | Units | Method | Reference | Comment |
Tfus | 190.78 | K | N/A | Miller, Greenlee, et al., 1954 | Uncertainty assigned by TRC = 2. K; TRC |

Gas phase ion energetics data

Data compiled as indicated in comments:
LLK - Sharon G. Lias, Rhoda D. Levin, and Sherif A. Kafafi
LBLHLM - Sharon G. Lias, John E. Bartmess, Joel F. Liebman, John L. Holmes, Rhoda D. Levin, and W. Gary Mallard
Ionization energy determinations
IE (eV) | Method | Reference | Comment |
---|---|---|---|
9.276 ± 0.010 | PE | Carlier, Dubois, et al., 1975 | LLK |
Appearance energy determinations
Ion | AE (eV) | Other Products | Method | Reference | Comment |
---|---|---|---|---|---|
C6H9+ | 9.72 | CH3 | EI | Lossing and Holmes, 1984 | LBLHLM |
C6H9+ | 9.36 ± 0.05 | CH3 | PI | Takhistov, Khlebnikova, et al., 1980 | LLK |

Kovats' RI, non-polar column, isothermal

Column type | Active phase | Temperature (C) | I | Reference | Comment |
---|---|---|---|---|---|
Capillary | Squalane | 80. | 612. | Soják, Farkas, et al., 1991 | 107. m/0.25 mm/0.40 μm, H2 |

References

Thermodynamics Research Center, 1997
Thermodynamics Research Center,
Selected Values of Properties of Chemical Compounds., Thermodynamics Research Center, Texas A&M University, College Station, Texas, 1997. [all data]
Farchan Laboratories, 1990
Farchan Laboratories,
Research Chemicals Catalog, Farchan Laboratories, Gainesville, FL, 1990, 91. [all data]
Miller, Greenlee, et al., 1954
Miller, H.M.; Greenlee, K.W.; Derfer, J.M.; Boord, C.E.,
J. Org. Chem., 1954, 19, 1882. [all data]
Zakharova, 1950
Zakharova, A.I.,
Zh. Obshch. Khim., 1950, 20, 1572. [all data]
De Graef, 1925
De Graef, H.,
Trimethylpropylmethane and Methylethylpropyllmethane,
Bull. Soc. Chim. Belg., 1925, 34, 427. [all data]
Carlier, Dubois, et al., 1975
Carlier, P.; Dubois, J.E.; Masclet, P.; Mouvier, G.,
Spectres de photoelectrons des alcynes,
J. Electron Spectrosc. Relat. Phenom., 1975, 7, 55. [all data]
Lossing and Holmes, 1984
Lossing, F.P.; Holmes, J.L.,
Stabilization energy and ion size in carbocations in the gas phase,
J. Am. Chem. Soc., 1984, 106, 6917. [all data]
Takhistov, Khlebnikova, et al., 1980
Takhistov, V.; Khlebnikova, N.; Orlov, V.,
Photoionization study of energetic properties of cations formed with fragmentation of substituted acetylenes containing elements of IV B group,
Org. React. Tartu, 1980, 17, 449. [all data]