Benzoic acid, 4-hydroxy-
- Formula: C7H6O3
- Molecular weight: 138.1207
- IUPAC Standard InChIKey: FJKROLUGYXJWQN-UHFFFAOYSA-N
- CAS Registry Number: 99-96-7
- Chemical structure:
View 3d structure (requires JavaScript / HTML 5) - Other names: Benzoic acid, p-hydroxy-; p-Hydroxybenzoic acid; p-Salicylic acid; Paraben-acid; 4-Carboxyphenol; 4-Hydroxybenzoic acid; para-Hydroxybenzoic acid; Hydroxybenzoic acid, para; Kyselina 4-hydroxybenzoova; NSC 4961; Paraben

Condensed phase thermochemistry data

Data compiled as indicated in comments:
ALS - Hussein Y. Afeefy, Joel F. Liebman, and Stephen E. Stein
DH - Eugene S. Domalski and Elizabeth D. Hearing
Quantity | Value | Units | Method | Reference | Comment |
---|---|---|---|---|---|
ΔfH°solid | -606.6 ± 2.1 | kJ/mol | Ccr | Sabbah and Le, 1993 | ALS |
ΔfH°solid | -594.5 ± 1.0 | kJ/mol | Ccb | Colomina, Jimenez, et al., 1980 | ALS |
Quantity | Value | Units | Method | Reference | Comment |
ΔcH°solid | -3005.4 ± 2.1 | kJ/mol | Ccr | Sabbah and Le, 1993 | Corresponding ΔfHºsolid = -606.7 kJ/mol (simple calculation by NIST; no Washburn corrections); ALS |
ΔcH°solid | -3017.6 ± 0.5 | kJ/mol | Ccb | Colomina, Jimenez, et al., 1980 | Corresponding ΔfHºsolid = -594.5 kJ/mol (simple calculation by NIST; no Washburn corrections); ALS |
Quantity | Value | Units | Method | Reference | Comment |
S°solid,1 bar | 175.7 | J/mol*K | N/A | Parks and Light, 1934 | Extrapolation below 90 K, 55.35 J/mol*K.; DH |
Constant pressure heat capacity of solid
Cp,solid (J/mol*K) | Temperature (K) | Reference | Comment |
---|---|---|---|
155.2 | 283.8 | Parks and Light, 1934 | T = 95 to 284 K. Value is unsmoothed experimental datum.; DH |

Phase change data

Data compiled as indicated in comments:
TRC - Thermodynamics Research Center, NIST Boulder Laboratories, Chris Muzny director
AC - William E. Acree, Jr., James S. Chickos
ALS - Hussein Y. Afeefy, Joel F. Liebman, and Stephen E. Stein
DRB - Donald R. Burgess, Jr.
Quantity | Value | Units | Method | Reference | Comment |
---|---|---|---|---|---|
Tfus | 488.1 | K | N/A | Armstrong, James, et al., 1979 | Uncertainty assigned by TRC = 0.5 K; TRC |
Tfus | 489. | K | N/A | Herbert, 1967 | Uncertainty assigned by TRC = 1. K; TRC |
Tfus | 489.35 | K | N/A | Davies and Jones, 1954 | Uncertainty assigned by TRC = 0.7 K; TRC |
Tfus | 486. | K | N/A | King, McWhirter, et al., 1945 | Uncertainty assigned by TRC = 4. K; TRC |
Quantity | Value | Units | Method | Reference | Comment |
ΔsubH° | 117.0 ± 0.5 | kJ/mol | C | Pinto, Diogo, et al., 2005 | AC |
ΔsubH° | 114.05 ± 0.69 | kJ/mol | C | Sabbah and Le, 1993 | ALS |
ΔsubH° | 114.0 | kJ/mol | N/A | Sabbah and Le, 1993 | DRB |
ΔsubH° | 114.1 ± 0.7 | kJ/mol | N/A | Sabbah and Le, 1993 | AC |
ΔsubH° | 116.1 ± 0.4 | kJ/mol | V | Davies and Jones, 1954 | ALS |
Enthalpy of sublimation
ΔsubH (kJ/mol) | Temperature (K) | Method | Reference | Comment |
---|---|---|---|---|
112.4 ± 0.7 | 363. | C | Sabbah and Le, 1993 | AC |
116.3 | 398. to 433. | GS | Davies and Jones, 1954 | See also Jones, 1960.; AC |
Enthalpy of fusion
ΔfusH (kJ/mol) | Temperature (K) | Method | Reference | Comment |
---|---|---|---|---|
30.9 | 488.1 | N/A | ARMSTRONG, JAMES, et al., 2011 | AC |
30.85 | 489. | N/A | Nordström and Rasmuson, 2006 | AC |
31.4 | 487.2 | N/A | Gracin and Rasmuson, 2002 | AC |
32.0 | 488. | DSC | Heath, Singh, et al., 1992 | AC |

Gas phase ion energetics data

Data compiled as indicated in comments:
B - John E. Bartmess
LLK - Sharon G. Lias, Rhoda D. Levin, and Sherif A. Kafafi
Ionization energy determinations
IE (eV) | Method | Reference | Comment |
---|---|---|---|
9.2 ± 0.2 | EI | Benoit, 1973 | LLK |
Appearance energy determinations
Ion | AE (eV) | Other Products | Method | Reference | Comment |
---|---|---|---|---|---|
C6H5O+ | 14.6 ± 0.2 | CO+OH | EI | Benoit, 1973 | LLK |
C7H5O2+ | 12.0 ± 0.2 | OH | EI | Benoit, 1973 | LLK |
De-protonation reactions
C7H5O3- + =
By formula: C7H5O3- + H+ = C7H6O3
Quantity | Value | Units | Method | Reference | Comment |
---|---|---|---|---|---|
ΔrH° | 1405. ± 8.8 | kJ/mol | G+TS | Kebarle and McMahon, 1977 | gas phase; This is probably the phenolic site acidity, not the carboxylic.; B |
Quantity | Value | Units | Method | Reference | Comment |
ΔrG° | 1376. ± 8.4 | kJ/mol | IMRE | Kebarle and McMahon, 1977 | gas phase; This is probably the phenolic site acidity, not the carboxylic.; B |

Gas phase thermochemistry data

Data compiled as indicated in comments:
ALS - Hussein Y. Afeefy, Joel F. Liebman, and Stephen E. Stein
DRB - Donald R. Burgess, Jr.
Quantity | Value | Units | Method | Reference | Comment |
---|---|---|---|---|---|
ΔfH°gas | -117.7 ± 0.53 | kcal/mol | Ccr | Sabbah and Le, 1993 | ALS |
ΔfH°gas | -114.8 | kcal/mol | N/A | Colomina, Jimenez, et al., 1980 | Value computed using ΔfHsolid° value of -594.5±1.0 kj/mol from Colomina, Jimenez, et al., 1980 and ΔsubH° value of 114.0 kj/mol from Sabbah and Le, 1993.; DRB |

Reaction thermochemistry data

Data compiled as indicated in comments:
B - John E. Bartmess
ALS - Hussein Y. Afeefy, Joel F. Liebman, and Stephen E. Stein
Individual Reactions
C7H5O3- + =
By formula: C7H5O3- + H+ = C7H6O3
Quantity | Value | Units | Method | Reference | Comment |
---|---|---|---|---|---|
ΔrH° | 335.9 ± 2.1 | kcal/mol | G+TS | Kebarle and McMahon, 1977 | gas phase; This is probably the phenolic site acidity, not the carboxylic.; B |
Quantity | Value | Units | Method | Reference | Comment |
ΔrG° | 328.9 ± 2.0 | kcal/mol | IMRE | Kebarle and McMahon, 1977 | gas phase; This is probably the phenolic site acidity, not the carboxylic.; B |
By formula: C9H8O4 + H2O = C2H4O2 + C7H6O3
Quantity | Value | Units | Method | Reference | Comment |
---|---|---|---|---|---|
ΔrH° | -4.93 ± 0.08 | kcal/mol | Cm | Nelander, 1964 | solid phase; Heat of hydrolysis; ALS |

Van Den Dool and Kratz RI, non-polar column, custom temperature program

View large format table.

Column type Active phase I Reference Comment
CapillaryVF-5MS1537.7Tret'yakov, 200830. m/0.25 mm/0.25 μm, He; Program: Multi-step temperature program; T(initial)=60C; T(final)=270C

Normal alkane RI, non-polar column, temperature ramp

View large format table.

Column type Active phase I Reference Comment
CapillaryHP-5 MS1558.Jerkovic, Hegic, et al., 201030. m/0.25 mm/0.25 μm, Helium, 70. C @ 2. min, 3. K/min, 200. C @ 18. min
CapillaryHP-5 MS1558.Jerkovic and Marijanovic, 201030. m/0.25 mm/0.25 μm, Helium, 70. C @ 2. min, 3. K/min, 200. C @ 18. min
CapillaryHP-5 MS1558.Jerkovic, Tuberso, et al., 201030. m/0.25 mm/0.25 μm, Helium, 70. C @ 2. min, 3. K/min, 200. C @ 18. min

Normal alkane RI, non-polar column, custom temperature program

View large format table.

Column type Active phase I Reference Comment
CapillaryHP-5MS1577.Alissandrakis, Kibaris, et al., 200530. m/0.25 mm/0.25 μm, He; Program: 40C(3min) => 2C/min => 180C => 10C/min => 250C(5min)

References

Sabbah and Le, 1993
Sabbah, R.; Le, T.H.D.,
Etude thermodynamique des trois isomeres de l'acide bydroxybenzolque,
Can. J. Chem., 1993, 71, 1378-1383. [all data]
Colomina, Jimenez, et al., 1980
Colomina, M.; Jimenez, P.; Roux, M.V.; Turrion, C.,
Thermochemical properties of o-, m- and p-hydroxybenzoic acids,
J. Calorim. Anal. Therm., 1980, 11, 1-6. [all data]
Parks and Light, 1934
Parks, G.S.; Light, D.W.,
Thermal data on organic compounds. XIII. The heat capacities and entropies of n-tetradecane and the hydroxybenzoic acids. The relative free energies of some benzenoid position isomers,
J. Am. Chem. Soc., 1934, 56, 1511-1513. [all data]
Armstrong, James, et al., 1979
Armstrong, N.A.; James, K.C.; Wong, C.K.,
Inter-relationships between solubilities, distribution coefficients and melting points of some substituted benzoic and phenylacetic acids,
J. Pharm. Pharmacol., 1979, 31, 1, 627, https://doi.org/10.1111/j.2042-7158.1979.tb13606.x
. [all data]
Herbert, 1967
Herbert, A.J.,
Transition temperatures and transition energies of the p-n-alkoxy benzoic acids, from n-propyl to n-octadecyl,
Trans. Faraday Soc., 1967, 63, 555, https://doi.org/10.1039/tf9676300555
. [all data]
Davies and Jones, 1954
Davies, M.; Jones, J.I.,
The sublimation pressures and heats of sublimation of some carboxylic acids,
Trans. Faraday Soc., 1954, 50, 1042. [all data]
King, McWhirter, et al., 1945
King, L.C.; McWhirter, M.; Barton, D.M.,
Reactions of Acetophenols with Iodine and Pyridine and the Preparation of Hydroxybenzoic Acids,
J. Am. Chem. Soc., 1945, 67, 2089-92. [all data]
Pinto, Diogo, et al., 2005
Pinto, Susana S.; Diogo, Hermínio P.; Guedes, Rita C.; Costa Cabral, Benedito J.; Minas da Piedade, Manuel E.; Martinho Simões, José A.,
Energetics of Hydroxybenzoic Acids and of the Corresponding Carboxyphenoxyl Radicals. Intramolecular Hydrogen Bonding in 2-Hydroxybenzoic Acid,
J. Phys. Chem. A, 2005, 109, 42, 9700-9708, https://doi.org/10.1021/jp054220g
. [all data]
Jones, 1960
Jones, A.H.,
Sublimation Pressure Data for Organic Compounds.,
J. Chem. Eng. Data, 1960, 5, 2, 196-200, https://doi.org/10.1021/je60006a019
. [all data]
ARMSTRONG, JAMES, et al., 2011
ARMSTRONG, N.A.; JAMES, K.C.; WONG, C.K.,
Inter-relationships between solubilities, distribution coefficients and melting points of some substituted benzoic and phenylacetic acids,
Journal of Pharmacy and Pharmacology, 2011, 31, 1, 627-631, https://doi.org/10.1111/j.2042-7158.1979.tb13606.x
. [all data]
Nordström and Rasmuson, 2006
Nordström, Fredrik L.; Rasmuson, Åke C.,
Phase equilibria and thermodynamics ofp-hydroxybenzoic acid,
J. Pharm. Sci., 2006, 95, 4, 748-760, https://doi.org/10.1002/jps.20569
. [all data]
Gracin and Rasmuson, 2002
Gracin, Sandra; Rasmuson, Åke C.,
Solubility of Phenylacetic Acid, p -Hydroxyphenylacetic Acid, p -Aminophenylacetic Acid, p -Hydroxybenzoic Acid, and Ibuprofen in Pure Solvents,
J. Chem. Eng. Data, 2002, 47, 6, 1379-1383, https://doi.org/10.1021/je0255170
. [all data]
Heath, Singh, et al., 1992
Heath, E.A.; Singh, P.; Ebisuzaki, Y.,
Structure of p-hydroxybenzoic acid and p-hydroxybenzoic acid-acetone complex (2/1),
Acta Crystallogr Sect C Cryst Struct Commun, 1992, 48, 11, 1960-1965, https://doi.org/10.1107/S0108270192002361
. [all data]
Benoit, 1973
Benoit, F.,
Substituent effects in mass spectrometry. III. Substituent effects in the dissociation of the molecular ions of para and meta subtituted benzoic acids,
Org. Mass Spectrom., 1973, 7, 295. [all data]
Kebarle and McMahon, 1977
Kebarle, P.; McMahon, T.B.,
Intrinsic Acidities of Substituted Phenols and Benzoic Acids Determined by Gas Phase Proton Transfer Equilibria,
J. Am. Chem. Soc., 1977, 99, 7, 2222, https://doi.org/10.1021/ja00449a032
. [all data]