Ethanone, 1-(4-bromophenyl)-
- Formula: C8H7BrO
- Molecular weight: 199.045
- IUPAC Standard InChIKey: WYECURVXVYPVAT-UHFFFAOYSA-N
- CAS Registry Number: 99-90-1
- Chemical structure:
View 3d structure (requires JavaScript / HTML 5) - Other names: Acetophenone, 4'-bromo-; p-Bromoacetophenone; p-Bromophenyl methyl ketone; Methyl p-bromophenyl ketone; 4'-Bromoacetophenone; 4-Bromoacetophenone; p-Bromobenzoyl

Phase change data

Data compiled by: Robert L. Brown and Stephen E. Stein
Quantity | Value | Units | Method | Reference | Comment |
---|---|---|---|---|---|
Tboil | 528.2 | K | N/A | Aldrich Chemical Company Inc., 1990 | |
Quantity | Value | Units | Method | Reference | Comment |
Tfus | 324. | K | N/A | Buckingham and Donaghy, 1982 |
Reduced pressure boiling point
Tboil (K) | Pressure (bar) | Reference |
---|---|---|
528.7 | 0.981 | Weast and Grasselli, 1989 |
528.6 | 0.981 | Buckingham and Donaghy, 1982 |
390. | 0.009 | Buckingham and Donaghy, 1982 |

Gas phase ion energetics data

Data compiled as indicated in comments:
LLK - Sharon G. Lias, Rhoda D. Levin, and Sherif A. Kafafi
RDSH - Henry M. Rosenstock, Keith Draxl, Bruce W. Steiner, and John T. Herron
Ionization energy determinations
IE (eV) | Method | Reference | Comment |
---|---|---|---|
9.0 ± 0.1 | PE | Egdell, Green, et al., 1975 | LLK |
9.55 | EI | Howe and Williams, 1969 | RDSH |
9.5 ± 0.1 | EI | Chin and Harrison, 1969 | RDSH |
Appearance energy determinations
Ion | AE (eV) | Other Products | Method | Reference | Comment |
---|---|---|---|---|---|
C7H4OBr+ | 10.58 | CH3 | EI | Howe and Williams, 1969 | RDSH |
C7H4OBr+ | 10.4 ± 0.1 | CH3 | EI | Chin and Harrison, 1969 | RDSH |

Kovats' RI, non-polar column, isothermal

Column type | Active phase | Temperature (C) | I | Reference | Comment |
---|---|---|---|---|---|
Packed | OV-101 | 120. | 1286.3 | Righezza, Hassani, et al., 1996 | N2, Chromosorb G HP; Column length: 5. m |
Packed | OV-101 | 130. | 1296.7 | Righezza, Hassani, et al., 1996 | N2, Chromosorb G HP; Column length: 5. m |
Packed | OV-101 | 140. | 1308. | Righezza, Hassani, et al., 1996 | N2, Chromosorb G HP; Column length: 5. m |
Packed | OV-101 | 160. | 1315.1 | Hassani and Meklati, 1992 | N2, Chromosorb G HP; Column length: 5. m |

Normal alkane RI, non-polar column, temperature ramp

Column type | Active phase | I | Reference | Comment |
---|---|---|---|---|
Capillary | Ultra-1 | 1278. | Okumura, 1991 | 25. m/0.32 mm/0.25 μm, He, 3. K/min; Tstart: 80. C; Tend: 260. C |

Normal alkane RI, non-polar column, custom temperature program

Column type | Active phase | I | Reference | Comment |
---|---|---|---|---|
Capillary | OV-101 | 1286. | Ebrahimi and Hadjmohammadi, 2006 | Program: not specified |

References

Aldrich Chemical Company Inc., 1990
Aldrich Chemical Company Inc.,
Catalog Handbook of Fine Chemicals, Aldrich Chemical Company, Inc., Milwaukee WI, 1990, 1. [all data]
Buckingham and Donaghy, 1982
Buckingham, J.; Donaghy, S.M.,
Dictionary of Organic Compounds: Fifth Edition, Chapman and Hall, New York, 1982, 1. [all data]
Weast and Grasselli, 1989
CRC Handbook of Data on Organic Compounds, 2nd Editon, Weast,R.C and Grasselli, J.G., ed(s)., CRC Press, Inc., Boca Raton, FL, 1989, 1. [all data]
Egdell, Green, et al., 1975
Egdell, R.; Green, J.C.; Rao, C.N.R.,
Photoelectron spectra of substituted benzenes,
Chem. Phys. Lett., 1975, 33, 600. [all data]
Howe and Williams, 1969
Howe, I.; Williams, D.H.,
Calculation and qualitative predictions of mass spectra. Mono- and paradisubstituted benzenes,
J. Am. Chem. Soc., 1969, 91, 7137. [all data]
Chin and Harrison, 1969
Chin, M.S.; Harrison, A.G.,
Substituent effects on ion abundances and energetics in substituted acetophenones,
Org. Mass Spectrom., 1969, 2, 1073. [all data]
Righezza, Hassani, et al., 1996
Righezza, M.; Hassani, A.; Meklati, B.Y.; Chrétien, J.R.,
Quantitative structure-retention relationships (QSRR) of congeneric aromatics series studied on phenyl OV phases in gas chromatography,
J. Chromatogr. A, 1996, 723, 1, 77-91, https://doi.org/10.1016/0021-9673(95)00816-0
. [all data]
Hassani and Meklati, 1992
Hassani, A.; Meklati, B.Y.,
Gas chromatographic behaviour of monosubstituted benzenes, benzaldehydes and acetophenones on OV polymethylphenyl-silicone stationary phases,
Chromatographia, 1992, 33, 5/6, 267-271, https://doi.org/10.1007/BF02276193
. [all data]
Okumura, 1991
Okumura, T.,
retention indices of environmental chemicals on methyl silicone capillary column,
Journal of Environmental Chemistry (Japan), 1991, 1, 2, 333-358, https://doi.org/10.5985/jec.1.333
. [all data]
Ebrahimi and Hadjmohammadi, 2006
Ebrahimi, P.; Hadjmohammadi, M.R.,
Simultaneous modeling of the Kovats retention indices on phenyl OV stationary phases with different polarity using MLR and ANN,
QSAR Comb. Sci., 2006, 25, 10, 836-845, https://doi.org/10.1002/qsar.200530145
. [all data]