Phosphine, tributyl-
- Formula: C12H27P
- Molecular weight: 202.3165
- IUPAC Standard InChIKey: TUQOTMZNTHZOKS-UHFFFAOYSA-N
- CAS Registry Number: 998-40-3
- Chemical structure:
View 3d structure (requires JavaScript / HTML 5) - Other names: Tri-n-butylphosphine; Tributylphosphine; (n-C4H9)3P; Tributylphosphorus; Tris(butyl)phosphine; Tributylfosfin

Phase change data

Data compiled by: William E. Acree, Jr., James S. Chickos
Enthalpy of vaporization
ΔvapH (kJ/mol) | Temperature (K) | Reference | Comment |
---|---|---|---|
51.7 ± 0.5 | 390. | Baev, 2001 | Based on data from 353. to 428. K. |

Gas phase ion energetics data

Data compiled as indicated in comments:
LLK - Sharon G. Lias, Rhoda D. Levin, and Sherif A. Kafafi
RDSH - Henry M. Rosenstock, Keith Draxl, Bruce W. Steiner, and John T. Herron
Ionization energy determinations
IE (eV) | Method | Reference | Comment |
---|---|---|---|
7.5 | PE | Schmidt, Schweig, et al., 1975 | LLK |
8.00 ± 0.05 | EI | Distefano, Innorta, et al., 1968 | RDSH |
8.00 | PE | Schmidt, Schweig, et al., 1975 | Vertical value; LLK |

References

Baev, 2001
Baev, A.K.,
Izv. Vyssh. Uchebn. Zaved., Khim. Khim. Tekhnol., 2001, 44, 1, 3. [all data]
Schmidt, Schweig, et al., 1975
Schmidt, H.; Schweig, A.; Mathey, F.; Muller, G.,
Molecular conformation and hyperconjugation. P-C-hyperconjugation and the conformation of vinyl-, allyl-, phenyl- and benzylphosphines,
Tetrahedron, 1975, 31, 1287. [all data]
Distefano, Innorta, et al., 1968
Distefano, G.; Innorta, G.; Pignataro, S.; Foffani, A.,
Correlation between the ionization potentials of transition metal complexes and of the corresponding ligands,
J. Organometal. Chem., 1968, 14, 165. [all data]