Ethylenetricarbonitrile
- Formula: C5HN3
- Molecular weight: 103.0815
- IUPAC Standard InChIKey: DXBLIMATEQZDKB-UHFFFAOYSA-N
- CAS Registry Number: 997-76-2
- Chemical structure:
View 3d structure (requires JavaScript / HTML 5) - Permanent link for this species. Use this link for bookmarking this species for future reference.

Gas phase thermochemistry data

Data compiled by: Hussein Y. Afeefy, Joel F. Liebman, and Stephen E. Stein
Quantity | Value | Units | Method | Reference | Comment |
---|---|---|---|---|---|
ΔfH°gas | 520.4 ± 5.6 | kJ/mol | Ccb | Boyd, 1963 | Reanalyzed by Cox and Pilcher, 1970, Original value = 518.4 ± 6.7 kJ/mol |

Condensed phase thermochemistry data

Data compiled by: Hussein Y. Afeefy, Joel F. Liebman, and Stephen E. Stein
Quantity | Value | Units | Method | Reference | Comment |
---|---|---|---|---|---|
ΔfH°solid | 439. ± 3. | kJ/mol | Ccb | Boyd, 1963 | |
Quantity | Value | Units | Method | Reference | Comment |
ΔcH°solid | -2550. ± 3. | kJ/mol | Ccb | Boyd, 1963 |

Phase change data

Data compiled as indicated in comments:
AC - William E. Acree, Jr., James S. Chickos
ALS - Hussein Y. Afeefy, Joel F. Liebman, and Stephen E. Stein
DRB - Donald R. Burgess, Jr.
Quantity | Value | Units | Method | Reference | Comment |
---|---|---|---|---|---|
ΔsubH° | 81.2 ± 5.0 | kJ/mol | V | Boyd, 1963 | Reanalyzed by Cox and Pilcher, 1970, Original value = 79.1 kJ/mol; ALS |
ΔsubH° | 81.4 | kJ/mol | N/A | Boyd, 1963 | DRB |
Enthalpy of vaporization
ΔvapH (kJ/mol) | Temperature (K) | Method | Reference | Comment |
---|---|---|---|---|
66.0 | 328. | A,MG | Stephenson and Malanowski, 1987 | Based on data from 313. to 343. K. See also Boyd, 1963, 2.; AC |

Gas phase ion energetics data

Data compiled as indicated in comments:
LLK - Sharon G. Lias, Rhoda D. Levin, and Sherif A. Kafafi
Ionization energy determinations
IE (eV) | Method | Reference | Comment |
---|---|---|---|
~11.55 | PE | Houk and Munchausen, 1976 | LLK |

References

Boyd, 1963
Boyd, R.H.,
Thermochemistry of cyanocarbons,
J. Chem. Phys., 1963, 38, 2529-2535. [all data]
Cox and Pilcher, 1970
Cox, J.D.; Pilcher, G.,
Thermochemistry of Organic and Organometallic Compounds, Academic Press, New York, 1970, 1-636. [all data]
Stephenson and Malanowski, 1987
Stephenson, Richard M.; Malanowski, Stanislaw,
Handbook of the Thermodynamics of Organic Compounds, 1987, https://doi.org/10.1007/978-94-009-3173-2
. [all data]
Boyd, 1963, 2
Boyd, Richard H.,
Thermochemistry of Cyanocarbons,
J. Chem. Phys., 1963, 38, 10, 2529, https://doi.org/10.1063/1.1733536
. [all data]
Houk and Munchausen, 1976
Houk, K.N.; Munchausen, L.L.,
Ionization potentials, electron affinities, reactivities of cyanoalkenes related electron-deficient alkenes. A frontier molecular orbital treatment of cyanoalkene reactivities in cycloaddition, electrophilic, nucleophilic, and radical reactions.,
J. Am. Chem. Soc., 1976, 98, 937. [all data]