Diethylamine N-d1
- Formula: C4H10DN
- Molecular weight: 74.1430
- IUPAC Standard InChIKey: HPNMFZURTQLUMO-DYCDLGHISA-N
- CAS Registry Number: 997-11-5
- Chemical structure:
View 3d structure (requires JavaScript / HTML 5) - Isotopologues:

Gas phase ion energetics data

Data compiled by: Henry M. Rosenstock, Keith Draxl, Bruce W. Steiner, and John T. Herron
Ionization energy determinations
IE (eV) | Method | Reference |
---|---|---|
8.31 ± 0.01 | EI | Collin and Franskin, 1966 |
Appearance energy determinations
Ion | AE (eV) | Other Products | Method | Reference | Comment |
---|---|---|---|---|---|
CH3DN+ | 13.2 ± 0.1 | C2H4+CH3 | EI | Collin and Franskin, 1966 | |
C3H7DN+ | 9.53 ± 0.01 | ? | EI | Collin and Franskin, 1966 |

References

Collin and Franskin, 1966
Collin, J.E.; Franskin, M.J.,
Ionisation, dissociation et rearrangements intramoleculaires dans les amines aliphatiques soumises a l'impact electronique. Cas de la diethylamine et de la diethylamine-Nd,
Bull. Soc. Roy. Sci. Liege, 1966, 35, 285. [all data]