Tetrakis(dimethylamino)ethylene
- Formula: C10H24N4
- Molecular weight: 200.3244
- IUPAC Standard InChIKey: CBXRMKZFYQISIV-UHFFFAOYSA-N
- CAS Registry Number: 996-70-3
- Chemical structure:
View 3d structure (requires JavaScript / HTML 5) - Other names: Ethenetetramine, octamethyl-; N,N',N'',N'''-tetramethylethylenediylidenetetraamine

Phase change data

Data compiled as indicated in comments:
BS - Robert L. Brown and Stephen E. Stein
TRC - Thermodynamics Research Center, NIST Boulder Laboratories, Chris Muzny director
AC - William E. Acree, Jr., James S. Chickos
Quantity | Value | Units | Method | Reference | Comment |
---|---|---|---|---|---|
Tc | 680. | K | N/A | Steele, Chirico, et al., 1997 | Uncertainty assigned by TRC = 6. K; TRC |
Quantity | Value | Units | Method | Reference | Comment |
Pc | 24.00 | bar | N/A | Steele, Chirico, et al., 1997 | Uncertainty assigned by TRC = 2.00 bar; derived from fit of obs. vapor pressure; TRC |
Quantity | Value | Units | Method | Reference | Comment |
ρc | 1.55 | mol/l | N/A | Steele, Chirico, et al., 1997 | Uncertainty assigned by TRC = 0.075 mol/l; TRC |
Quantity | Value | Units | Method | Reference | Comment |
ΔvapH° | 53.9 ± 0.5 | kJ/mol | EB | Steele, Chirico, et al., 1997, 2 | Based on data from 358. to 485. K.; AC |
Reduced pressure boiling point
Tboil (K) | Pressure (bar) | Reference | Comment |
---|---|---|---|
332.2 | 0.001 | Aldrich Chemical Company Inc., 1990 | BS |

Gas phase ion energetics data

Data compiled by: Sharon G. Lias, Rhoda D. Levin, and Sherif A. Kafafi
Ionization energy determinations
IE (eV) | Method | Reference | Comment |
---|---|---|---|
≤5.36 | PI | Nakato, Ozaki, et al., 1972 | |
≤5.36 ± 0.02 | PI | Nakato, Ozaki, et al., 1971 | |
5.95 | PE | Cetinkaya, King, et al., 1971 | Vertical value |

Van Den Dool and Kratz RI, non-polar column, custom temperature program

Column type | Active phase | I | Reference | Comment |
---|---|---|---|---|
Capillary | VF-5MS | 1159. | Tretyakov, 2011 | 30. m/0.25 mm/0.25 μm, He; Program: Multi-step temperature program; T(initial)=60C; T(final)=270C |

References

Steele, Chirico, et al., 1997
Steele, W.V.; Chirico, R.D.; Knipmeyer, S.E.; Nguyen, A.; Smith, N.K.,
Thermocynamic Properties and Ideal-Gas Enthalpies of Formation for Carbonate, Piperazine, Hexachloroprop-1-ene, Tetrakis(dimethylamino) ethylene, N,N'-Bis(2-hydroxyethyl)ethylenediamine, and 1,2,4-Tr,
J. Chem. Eng. Data, 1997, 42, 1037-52. [all data]
Steele, Chirico, et al., 1997, 2
Steele, W.V.; Chirico, R.D.; Knipmeyer, S.E.; Nguyen, A.; Smith, N.K.,
Thermodynamic Properties and Ideal-Gas Enthalpies of Formation for Dicyclohexyl Sulfide, Diethylenetriamine, Di- n -octyl Sulfide, Dimethyl Carbonate, Piperazine, Hexachloroprop-1-ene, Tetrakis(dimethylamino)ethylene, N , N '-Bis-(2-hydroxyethyl)ethylenediamine, and 1,2,4-Triazolo[1,5- a ]pyrimidine,
J. Chem. Eng. Data, 1997, 42, 6, 1037-1052, https://doi.org/10.1021/je9700986
. [all data]
Aldrich Chemical Company Inc., 1990
Aldrich Chemical Company Inc.,
Catalog Handbook of Fine Chemicals, Aldrich Chemical Company, Inc., Milwaukee WI, 1990, 1. [all data]
Nakato, Ozaki, et al., 1972
Nakato, Y.; Ozaki, M.; Tsubomura, H.,
Ionization energies and Rydberg states of tetraaminoethylenes,
Bull. Chem. Soc. Jpn., 1972, 45, 1299. [all data]
Nakato, Ozaki, et al., 1971
Nakato, Y.; Ozaki, M.; Egawa, A.; Tsubornura, H.,
Organic amino compounds with very low ionization potentials,
Chem. Phys. Lett., 1971, 9, 615. [all data]
Cetinkaya, King, et al., 1971
Cetinkaya, B.; King, G.H.; Krishnamurthy, S.S.; Lappert, M.F.; Pedley, J.B.,
Photoelectron spectra of electron-rich olefins and an isostructural boron compound; olefins of exceptionally low first ionisation potential,
Chem. Commun., 1971, 1370. [all data]
Tretyakov, 2011
Tretyakov, K.V.,
Retention Data. NIST Mass Spectrometry Data Center., NIST Mass Spectrometry Data Center, 2011. [all data]