2,2'-Spirobi[naphtho[2,3-d]-1,3-dioxole

Gas phase ion energetics data

Data compiled by: Sharon G. Lias, John E. Bartmess, Joel F. Liebman, John L. Holmes, Rhoda D. Levin, and W. Gary Mallard

Ionization energy determinations

IE (eV) Method Reference Comment
7.8PEGleiter and Uschmann, 1986
7.9PEGleiter and Uschmann, 1986Vertical value

References

Gleiter and Uschmann, 1986
Gleiter, R.; Uschmann, J., Electronic structure of heterospirenes - PE spectroscopic investigations, J. Org. Chem., 1986, 51, 370. [all data]