Distannane, hexaethyl-
- Formula: C12H30Sn2
- Molecular weight: 411.787
- IUPAC Standard InChIKey: LOAWHQCNQSFKDK-UHFFFAOYSA-N
- CAS Registry Number: 993-63-5
- Chemical structure:
View 3d structure (requires JavaScript / HTML 5) - Permanent link for this species. Use this link for bookmarking this species for future reference.

Gas phase thermochemistry data

Data compiled by: José A. Martinho Simões
Quantity | Value | Units | Method | Reference | Comment |
---|---|---|---|---|---|
ΔfH°gas | -148.3 ± 9.6 | kJ/mol | Review | Martinho Simões |

Condensed phase thermochemistry data

Data compiled by: José A. Martinho Simões
Quantity | Value | Units | Method | Reference | Comment |
---|---|---|---|---|---|
ΔfH°liquid | -211.1 ± 8.6 | kJ/mol | Review | Martinho Simões | |
Quantity | Value | Units | Method | Reference | Comment |
ΔcH°liquid | -9953.7 ± 8.4 | kJ/mol | CC-SB | Tel'noi and Rabinovich, 1966 | Please also see Pedley and Rylance, 1977 and Cox and Pilcher, 1970. |

Phase change data

Data compiled by: José A. Martinho Simões
Quantity | Value | Units | Method | Reference | Comment |
---|---|---|---|---|---|
ΔvapH° | 62.8 ± 4.2 | kJ/mol | CC-SB | Cox and Pilcher, 1970 |

Gas phase ion energetics data

Data compiled as indicated in comments:
LBLHLM - Sharon G. Lias, John E. Bartmess, Joel F. Liebman, John L. Holmes, Rhoda D. Levin, and W. Gary Mallard
RDSH - Henry M. Rosenstock, Keith Draxl, Bruce W. Steiner, and John T. Herron
Ionization energy determinations
IE (eV) | Method | Reference | Comment |
---|---|---|---|
6.60 ± 0.02 | EI | Pitt, Bursey, et al., 1970 | RDSH |
7.82 | PE | Mochida, Worley, et al., 1985 | Vertical value; LBLHLM |

References

Martinho Simões
Martinho Simões, J.A.,
Private communication (see http://webbook.nist.gov/chemistry/om/). [all data]
Tel'noi and Rabinovich, 1966
Tel'noi, V.I.; Rabinovich, I.B.,
Russ. J. Phys. Chem., 1966, 40, 842. [all data]
Pedley and Rylance, 1977
Pedley, J.B.; Rylance, J.,
Computer Analysed Thermochemical Data: Organic and Organometallic Compounds, University of Sussex, Brigton, 1977. [all data]
Cox and Pilcher, 1970
Cox, J.D.; Pilcher, G.,
Thermochemistry of Organic and Organometallic Compounds
in Academic Press, New York, 1970. [all data]
Pitt, Bursey, et al., 1970
Pitt, C.G.; Bursey, M.M.; Rogerson, P.F.,
Catenates of the group IV elements. Correlation of σ electron energies,
J. Am. Chem. Soc., 1970, 92, 519. [all data]
Mochida, Worley, et al., 1985
Mochida, K.; Worley, S.; Kochi, J.,
UV photoelectron spectra of peralkylated catenates of Group 4B elements (silicon, germanium, and tin),
Bull. Chem. Soc. Jpn., 1985, 58, 3389. [all data]