Benzoic acid, 3-hydroxy-
- Formula: C7H6O3
- Molecular weight: 138.1207
- IUPAC Standard InChIKey: IJFXRHURBJZNAO-UHFFFAOYSA-N
- CAS Registry Number: 99-06-9
- Chemical structure:
View 3d structure (requires JavaScript / HTML 5) - Other names: Benzoic acid, m-hydroxy-; m-Hydroxybenzoic acid; m-Salicylic acid; 3-Carboxyphenol; 3-Hydroxybenzoic acid; meta-Hydroxybenzoic acid; Acido m-idrossibenzoico; m-Hba; Kyselina 3-hydroxybenzoova; NSC 55746

Gas phase thermochemistry data

Data compiled as indicated in comments:
ALS - Hussein Y. Afeefy, Joel F. Liebman, and Stephen E. Stein
DRB - Donald R. Burgess, Jr.
Quantity | Value | Units | Method | Reference | Comment |
---|---|---|---|---|---|
ΔfH°gas | -469.1 ± 1.3 | kJ/mol | Ccr | Sabbah and Le, 1993 | ALS |
ΔfH°gas | -465.5 | kJ/mol | N/A | Colomina, Jimenez, et al., 1980 | Value computed using ΔfHsolid° value of -590.5±1.0 kj/mol from Colomina, Jimenez, et al., 1980 and ΔsubH° value of 125.0 kj/mol from Sabbah and Le, 1993.; DRB |

Condensed phase thermochemistry data

Data compiled as indicated in comments:
ALS - Hussein Y. Afeefy, Joel F. Liebman, and Stephen E. Stein
DH - Eugene S. Domalski and Elizabeth D. Hearing
Quantity | Value | Units | Method | Reference | Comment |
---|---|---|---|---|---|
ΔfH°solid | -594.1 ± 1.1 | kJ/mol | Ccr | Sabbah and Le, 1993 | ALS |
ΔfH°solid | -590.5 ± 1.0 | kJ/mol | Ccb | Colomina, Jimenez, et al., 1980 | ALS |
Quantity | Value | Units | Method | Reference | Comment |
ΔcH°solid | -3017.9 ± 1.1 | kJ/mol | Ccr | Sabbah and Le, 1993 | Corresponding ΔfHºsolid = -594.2 kJ/mol (simple calculation by NIST; no Washburn corrections); ALS |
ΔcH°solid | -3021.6 ± 0.4 | kJ/mol | Ccb | Colomina, Jimenez, et al., 1980 | Corresponding ΔfHºsolid = -590.5 kJ/mol (simple calculation by NIST; no Washburn corrections); ALS |
Quantity | Value | Units | Method | Reference | Comment |
S°solid,1 bar | 177.0 | J/mol*K | N/A | Parks and Light, 1934 | Extrapolation below 90 K, 56.48 J/mol*K.; DH |
Constant pressure heat capacity of solid
Cp,solid (J/mol*K) | Temperature (K) | Reference | Comment |
---|---|---|---|
157.3 | 288.4 | Parks and Light, 1934 | T = 94 to 288 K. Value is unsmoothed experimental datum.; DH |

Phase change data

Data compiled as indicated in comments:
TRC - Thermodynamics Research Center, NIST Boulder Laboratories, Chris Muzny director
AC - William E. Acree, Jr., James S. Chickos
ALS - Hussein Y. Afeefy, Joel F. Liebman, and Stephen E. Stein
DRB - Donald R. Burgess, Jr.
Quantity | Value | Units | Method | Reference | Comment |
---|---|---|---|---|---|
Tfus | 472. | K | N/A | Mayer, Howell, et al., 1990 | Uncertainty assigned by TRC = 1.5 K; TRC |
Tfus | 364. | K | N/A | Kuhn and Dury, 1951 | Uncertainty assigned by TRC = 3. K; TRC |
Tfus | 472. | K | N/A | King, McWhirter, et al., 1945 | Uncertainty assigned by TRC = 6. K; TRC |
Quantity | Value | Units | Method | Reference | Comment |
ΔsubH° | 118.3 ± 1.1 | kJ/mol | C | Pinto, Diogo, et al., 2005 | AC |
ΔsubH° | 124.99 ± 0.74 | kJ/mol | C | Sabbah and Le, 1993 | ALS |
ΔsubH° | 125.0 | kJ/mol | N/A | Sabbah and Le, 1993 | DRB |
ΔsubH° | 125.0 ± 0.74 | kJ/mol | N/A | Sabbah and Le, 1993 | AC |
Enthalpy of sublimation
ΔsubH (kJ/mol) | Temperature (K) | Method | Reference | Comment |
---|---|---|---|---|
123.5 ± 0.74 | 363. | C | Sabbah and Le, 1993 | AC |
Enthalpy of fusion
ΔfusH (kJ/mol) | Temperature (K) | Reference | Comment |
---|---|---|---|
36.5 | 476.4 | Pinto, Diogo, et al., 2005 | AC |
26.2 | 475.1 | Domalski and Hearing, 1996 | See also Sabbah and Le, 1993.; AC |

Reaction thermochemistry data

Data compiled by: John E. Bartmess
Individual Reactions
C7H5O3- + =
By formula: C7H5O3- + H+ = C7H6O3
Quantity | Value | Units | Method | Reference | Comment |
---|---|---|---|---|---|
ΔrH° | 1417. ± 8.8 | kJ/mol | G+TS | Kebarle and McMahon, 1977 | gas phase |
Quantity | Value | Units | Method | Reference | Comment |
ΔrG° | 1387. ± 8.4 | kJ/mol | IMRE | Kebarle and McMahon, 1977 | gas phase |

Gas phase ion energetics data

Data compiled as indicated in comments:
B - John E. Bartmess
LLK - Sharon G. Lias, Rhoda D. Levin, and Sherif A. Kafafi
Ionization energy determinations
IE (eV) | Method | Reference | Comment |
---|---|---|---|
9.2 ± 0.2 | EI | Benoit, 1973 | LLK |
Appearance energy determinations
Ion | AE (eV) | Other Products | Method | Reference | Comment |
---|---|---|---|---|---|
C6H5O+ | 14.4 ± 0.2 | CO+OH | EI | Benoit, 1973 | LLK |
C7H5O2+ | 12.5 ± 0.2 | OH | EI | Benoit, 1973 | LLK |
De-protonation reactions
C7H5O3- + =
By formula: C7H5O3- + H+ = C7H6O3
Quantity | Value | Units | Method | Reference | Comment |
---|---|---|---|---|---|
ΔrH° | 1417. ± 8.8 | kJ/mol | G+TS | Kebarle and McMahon, 1977 | gas phase; B |
Quantity | Value | Units | Method | Reference | Comment |
ΔrG° | 1387. ± 8.4 | kJ/mol | IMRE | Kebarle and McMahon, 1977 | gas phase; B |

Normal alkane RI, non-polar column, isothermal

Column type | Active phase | Temperature (C) | I | Reference | Comment |
---|---|---|---|---|---|
Packed | Apieson L | 140. | 1417. | Hedin, Minyard, et al., 1967 | Nitrogen, Chromosorb W HMDS (60-80 mesh); Column length: 1.8 m |

References

Sabbah and Le, 1993
Sabbah, R.; Le, T.H.D.,
Etude thermodynamique des trois isomeres de l'acide bydroxybenzolque,
Can. J. Chem., 1993, 71, 1378-1383. [all data]
Colomina, Jimenez, et al., 1980
Colomina, M.; Jimenez, P.; Roux, M.V.; Turrion, C.,
Thermochemical properties of o-, m- and p-hydroxybenzoic acids,
J. Calorim. Anal. Therm., 1980, 11, 1-6. [all data]
Parks and Light, 1934
Parks, G.S.; Light, D.W.,
Thermal data on organic compounds. XIII. The heat capacities and entropies of n-tetradecane and the hydroxybenzoic acids. The relative free energies of some benzenoid position isomers,
J. Am. Chem. Soc., 1934, 56, 1511-1513. [all data]
Mayer, Howell, et al., 1990
Mayer, M.M.; Howell, W.J.; Tomasko, D.L.; Eckert, C.A.,
Solid-solid Equilibria in the Systems Thianthrene + Phenanthrene, Salicylic Acid + Phenanthrene, and 3-Hydroxybenzoic Acid + Phenanthrene,
J. Chem. Eng. Data, 1990, 35, 446. [all data]
Kuhn and Dury, 1951
Kuhn, R.; Dury, K.,
6-Acetylsalicylic acid,
Chem. Ber., 1951, 84, 848-50. [all data]
King, McWhirter, et al., 1945
King, L.C.; McWhirter, M.; Barton, D.M.,
Reactions of Acetophenols with Iodine and Pyridine and the Preparation of Hydroxybenzoic Acids,
J. Am. Chem. Soc., 1945, 67, 2089-92. [all data]
Pinto, Diogo, et al., 2005
Pinto, Susana S.; Diogo, Hermínio P.; Guedes, Rita C.; Costa Cabral, Benedito J.; Minas da Piedade, Manuel E.; Martinho Simões, José A.,
Energetics of Hydroxybenzoic Acids and of the Corresponding Carboxyphenoxyl Radicals. Intramolecular Hydrogen Bonding in 2-Hydroxybenzoic Acid,
J. Phys. Chem. A, 2005, 109, 42, 9700-9708, https://doi.org/10.1021/jp054220g
. [all data]
Domalski and Hearing, 1996
Domalski, Eugene S.; Hearing, Elizabeth D.,
Heat Capacities and Entropies of Organic Compounds in the Condensed Phase. Volume III,
J. Phys. Chem. Ref. Data, 1996, 25, 1, 1, https://doi.org/10.1063/1.555985
. [all data]
Kebarle and McMahon, 1977
Kebarle, P.; McMahon, T.B.,
Intrinsic Acidities of Substituted Phenols and Benzoic Acids Determined by Gas Phase Proton Transfer Equilibria,
J. Am. Chem. Soc., 1977, 99, 7, 2222, https://doi.org/10.1021/ja00449a032
. [all data]
Benoit, 1973
Benoit, F.,
Substituent effects in mass spectrometry. III. Substituent effects in the dissociation of the molecular ions of para and meta subtituted benzoic acids,
Org. Mass Spectrom., 1973, 7, 295. [all data]