Benzoic acid, 3-amino-
- Formula: C7H7NO2
- Molecular weight: 137.1360
- IUPAC Standard InChIKey: XFDUHJPVQKIXHO-UHFFFAOYSA-N
- CAS Registry Number: 99-05-8
- Chemical structure:
View 3d structure (requires JavaScript / HTML 5) - Other names: Benzoic acid, m-amino-; m-Aminobenzoic acid; m-Carboxyaniline; 3-Aminobenzoic acid; 3-Carboxyaniline; Aniline-3-carboxylic acid; Maba

Gas phase thermochemistry data

Data compiled by: Hussein Y. Afeefy, Joel F. Liebman, and Stephen E. Stein
Quantity | Value | Units | Method | Reference | Comment |
---|---|---|---|---|---|
ΔfH°gas | -289.3 ± 3.6 | kJ/mol | Ccr | Nabavian, Sabbah, et al., 1977 | Author was aware that data differs from previously reported values |

Condensed phase thermochemistry data

Data compiled as indicated in comments:
ALS - Hussein Y. Afeefy, Joel F. Liebman, and Stephen E. Stein
DH - Eugene S. Domalski and Elizabeth D. Hearing
Quantity | Value | Units | Method | Reference | Comment |
---|---|---|---|---|---|
ΔfH°solid | -417.3 ± 1.6 | kJ/mol | Ccr | Nabavian, Sabbah, et al., 1977 | Author was aware that data differs from previously reported values; ALS |
ΔfH°solid | -411. ± 0.4 | kJ/mol | Ccb | Lebedeva, Gutner, et al., 1971 | Hfusion=5.2±0.2, see Lebedeva, Rjadnenko, et al., 1969; ALS |
Quantity | Value | Units | Method | Reference | Comment |
ΔcH°solid | -3337.6 ± 1.3 | kJ/mol | Ccr | Nabavian, Sabbah, et al., 1977 | Author was aware that data differs from previously reported values; ALS |
ΔcH°solid | -3344. ± 0.4 | kJ/mol | Ccb | Lebedeva, Gutner, et al., 1971 | Hfusion=5.2±0.2, see Lebedeva, Rjadnenko, et al., 1969; ALS |
Constant pressure heat capacity of solid
Cp,solid (J/mol*K) | Temperature (K) | Reference | Comment |
---|---|---|---|
179.9 | 323. | Satoh and Sogabe, 1941 | T = 0 to 100 C. Mean value.; DH |
162.8 | 298. | Andrews, Lynn, et al., 1926 | T = 22 to 180 C.; DH |

Phase change data

Data compiled as indicated in comments:
TRC - Thermodynamics Research Center, NIST Boulder Laboratories, Chris Muzny director
ALS - Hussein Y. Afeefy, Joel F. Liebman, and Stephen E. Stein
AC - William E. Acree, Jr., James S. Chickos
DH - Eugene S. Domalski and Elizabeth D. Hearing
Quantity | Value | Units | Method | Reference | Comment |
---|---|---|---|---|---|
Tfus | 452.9 | K | N/A | Andrews, Lynn, et al., 1926, 2 | Uncertainty assigned by TRC = 0.6 K; accompanied by some decomposition; TRC |
Quantity | Value | Units | Method | Reference | Comment |
ΔsubH° | 128.0 ± 3.2 | kJ/mol | V | Sabbah, Chastelet, et al., 1974 | ALS |
ΔsubH° | 128. ± 3.2 | kJ/mol | C | Sabbah, Chastel, et al., 1974 | See also Nabavian, Sabbah, et al., 1977, 2.; AC |
Enthalpy of sublimation
ΔsubH (kJ/mol) | Temperature (K) | Method | Reference | Comment |
---|---|---|---|---|
122. ± 1. | 374.8 | TE | de Kruif, Voogd, et al., 1979 | AC |
122. ± 3. | 367. to 389. | C | Sabbah, Chastel, et al., 1974 | AC |
Enthalpy of fusion
ΔfusH (kJ/mol) | Temperature (K) | Reference | Comment |
---|---|---|---|
33.7 | 445.7 | Rotich, Glass, et al., 2001 | AC |
21.84 | 452.9 | Acree, 1991 | AC |
21.840 | 452.9 | Andrews, Lynn, et al., 1926 | DH |
Entropy of fusion
ΔfusS (J/mol*K) | Temperature (K) | Reference | Comment |
---|---|---|---|
48.2 | 452.9 | Andrews, Lynn, et al., 1926 | DH |

Reaction thermochemistry data

Data compiled by: John E. Bartmess
Individual Reactions
C7H6NO2- + =
By formula: C7H6NO2- + H+ = C7H7NO2
Quantity | Value | Units | Method | Reference | Comment |
---|---|---|---|---|---|
ΔrH° | 1429. ± 8.8 | kJ/mol | G+TS | Kebarle and McMahon, 1977 | gas phase |
Quantity | Value | Units | Method | Reference | Comment |
ΔrG° | 1400. ± 8.4 | kJ/mol | IMRE | Kebarle and McMahon, 1977 | gas phase |

Gas phase ion energetics data

Data evaluated as indicated in comments:
HL - Edward P. Hunter and Sharon G. Lias
Data compiled as indicated in comments:
B - John E. Bartmess
LLK - Sharon G. Lias, Rhoda D. Levin, and Sherif A. Kafafi
Quantity | Value | Units | Method | Reference | Comment |
---|---|---|---|---|---|
Proton affinity (review) | 864.7 | kJ/mol | N/A | Hunter and Lias, 1998 | HL |
Quantity | Value | Units | Method | Reference | Comment |
Gas basicity | 832.3 | kJ/mol | N/A | Hunter and Lias, 1998 | HL |
Ionization energy determinations
IE (eV) | Method | Reference | Comment |
---|---|---|---|
7.8 | PE | Meeks, Wahlborg, et al., 1981 | LLK |
8.4 ± 0.2 | EI | Benoit, 1973 | LLK |
8.3 | PE | Meeks, Wahlborg, et al., 1981 | Vertical value; LLK |
Appearance energy determinations
Ion | AE (eV) | Other Products | Method | Reference | Comment |
---|---|---|---|---|---|
C6H6N+ | 14.3 ± 0.2 | CO+OH | EI | Benoit, 1973 | LLK |
C7H6NO+ | 12.2 ± 0.2 | OH | EI | Benoit, 1973 | LLK |
De-protonation reactions
C7H6NO2- + =
By formula: C7H6NO2- + H+ = C7H7NO2
Quantity | Value | Units | Method | Reference | Comment |
---|---|---|---|---|---|
ΔrH° | 1429. ± 8.8 | kJ/mol | G+TS | Kebarle and McMahon, 1977 | gas phase; B |
Quantity | Value | Units | Method | Reference | Comment |
ΔrG° | 1400. ± 8.4 | kJ/mol | IMRE | Kebarle and McMahon, 1977 | gas phase; B |

References

Nabavian, Sabbah, et al., 1977
Nabavian, P.M.; Sabbah, R.; Chastel, R.; Laffitte, M.,
Thermodynamique de composes azotes. II. Etude thermochimique des acides aminobenzoiques, de la pyrimidine, de l'uracile et de la thymine.,
J. Chim. Phys., 1977, 74, 115-126. [all data]
Lebedeva, Gutner, et al., 1971
Lebedeva, N.D.; Gutner, N.M.; Ryadnenko, V.L.,
Heats of combustion and formation of certain aromatic amino-derivatives,
Russ. J. Phys. Chem. (Engl. Transl.), 1971, 45, 561-562. [all data]
Lebedeva, Rjadnenko, et al., 1969
Lebedeva, N.D.; Rjadnenko, B.L.; Gutner, N.M.,
Heats of formation of some N-containing organic compounds,
Int. Conf. Calorim. Therm. (Warsaw, Poland), 1969, 1-8. [all data]
Satoh and Sogabe, 1941
Satoh, S.; Sogabe, T.,
The heat capacities of some organic compounds containing nitrogen and the atomic heat of nitrogen. (2), Sci.,
Pap. Inst. Phys. Chem. Res. (Tokyo), 1941, 38, 231-237. [all data]
Andrews, Lynn, et al., 1926
Andrews, D.H.; Lynn, G.; Johnston, J.,
The heat capacities and heat of crystallization of some isomeric aromatic compounds,
J. Am. Chem. Soc., 1926, 48, 1274-1287. [all data]
Andrews, Lynn, et al., 1926, 2
Andrews, D.H.; Lynn, G.; Johnston, J.,
The Heat Capacities and Heat of Crystallization of Some Isomeric Aromatic Compounds,
J. Am. Chem. Soc., 1926, 48, 1274. [all data]
Sabbah, Chastelet, et al., 1974
Sabbah, R.; Chastelet, R.; Laffitte, M.,
Thermodynamic de composès azotes. I. Etude calorimètrique des enthalpies de sublimation des trios acides aminobenzoïques,
Can. J. Chem., 1974, 52, 2201. [all data]
Sabbah, Chastel, et al., 1974
Sabbah, Raphaël; Chastel, Raymond; Laffitte, Marc,
Thermodynamique de composés azotés. I. Etude calorimétrique des enthalpies de sublimation des trois acides aminobenzoïques,
Can. J. Chem., 1974, 52, 12, 2201-2205, https://doi.org/10.1139/v74-319
. [all data]
Nabavian, Sabbah, et al., 1977, 2
Nabavian, M.; Sabbah, R.; Chastel, R.; Laffitte, M.,
J. Chim. Phys.Phys.-Chim. Biol., 1977, 74, 115. [all data]
de Kruif, Voogd, et al., 1979
de Kruif, C.G.; Voogd, J.; Offringa, J.C.A.,
Enthalpies of sublimation and vapour pressures of 14 amino acids and peptides,
The Journal of Chemical Thermodynamics, 1979, 11, 7, 651-656, https://doi.org/10.1016/0021-9614(79)90030-2
. [all data]
Rotich, Glass, et al., 2001
Rotich, M.K.; Glass, B.D.; Brown, M.E.,
Journal of Thermal Analysis and Calorimetry, 2001, 64, 2, 681-688, https://doi.org/10.1023/A:1011584125859
. [all data]
Acree, 1991
Acree, William E.,
Thermodynamic properties of organic compounds: enthalpy of fusion and melting point temperature compilation,
Thermochimica Acta, 1991, 189, 1, 37-56, https://doi.org/10.1016/0040-6031(91)87098-H
. [all data]
Kebarle and McMahon, 1977
Kebarle, P.; McMahon, T.B.,
Intrinsic Acidities of Substituted Phenols and Benzoic Acids Determined by Gas Phase Proton Transfer Equilibria,
J. Am. Chem. Soc., 1977, 99, 7, 2222, https://doi.org/10.1021/ja00449a032
. [all data]
Hunter and Lias, 1998
Hunter, E.P.; Lias, S.G.,
Evaluated Gas Phase Basicities and Proton Affinities of Molecules: An Update,
J. Phys. Chem. Ref. Data, 1998, 27, 3, 413-656, https://doi.org/10.1063/1.556018
. [all data]
Meeks, Wahlborg, et al., 1981
Meeks, J.; Wahlborg, A.; McGlynn, S.P.,
Photoelectron spectroscopy of carbonyls: Benzoic acid and its derivatives,
J. Electron Spectrosc. Relat. Phenom., 1981, 22, 43. [all data]
Benoit, 1973
Benoit, F.,
Substituent effects in mass spectrometry. III. Substituent effects in the dissociation of the molecular ions of para and meta subtituted benzoic acids,
Org. Mass Spectrom., 1973, 7, 295. [all data]