Benzene, nitro-
- Formula: C6H5NO2
- Molecular weight: 123.1094
- IUPAC Standard InChIKey: LQNUZADURLCDLV-UHFFFAOYSA-N
- CAS Registry Number: 98-95-3
- Chemical structure:
View 3d structure (requires JavaScript / HTML 5) - Isotopologues:
- Other names: Essence of Mirbane; Essence of Myrbane; Mirbane oil; Nitrobenzene; Nitrobenzol; Oil of Mirbane; Oil of Myrbane; Nitrobenzeen; Nitrobenzen; NCI-C60082; Rcra waste number U169; UN 1662; NSC 9573

Gas phase thermochemistry data

Data compiled by: Hussein Y. Afeefy, Joel F. Liebman, and Stephen E. Stein
Quantity | Value | Units | Method | Reference | Comment |
---|---|---|---|---|---|
ΔfH°gas | 68.53 ± 0.67 | kJ/mol | Ccb | Lebedeva, Katin, et al., 1971 | Reanalyzed by Pedley, Naylor, et al., 1986, Original value = 65.77 ± 0.42 kJ/mol |

Reaction thermochemistry data

Data compiled as indicated in comments:
B - John E. Bartmess
M - Michael M. Meot-Ner (Mautner) and Sharon G. Lias
Individual Reactions
By formula: Cl- + C6H5NO2 = (Cl- • C6H5NO2)
Quantity | Value | Units | Method | Reference | Comment |
---|---|---|---|---|---|
ΔrH° | 68.2 ± 4.2 | kJ/mol | TDAs | Chowdhury and Kebarle, 1986 | gas phase; B,M |
ΔrH° | 69.0 | kJ/mol | PHPMS | Paul and Kebarle, 1991 | gas phase; from Ph. D. thesis of S. Chowdhury, Entropy change calculated or estimated; M |
Quantity | Value | Units | Method | Reference | Comment |
ΔrS° | 84. | J/mol*K | N/A | Paul and Kebarle, 1991 | gas phase; from Ph. D. thesis of S. Chowdhury, Entropy change calculated or estimated; M |
ΔrS° | 81.2 | J/mol*K | PHPMS | Chowdhury and Kebarle, 1986 | gas phase; M |
Quantity | Value | Units | Method | Reference | Comment |
ΔrG° | 43.9 ± 6.7 | kJ/mol | TDAs | Chowdhury and Kebarle, 1986 | gas phase; B |
ΔrG° | 29.7 | kJ/mol | TDEq | French, Ikuta, et al., 1982 | gas phase; B |
Free energy of reaction
ΔrG° (kJ/mol) | T (K) | Method | Reference | Comment |
---|---|---|---|---|
43.9 | 300. | PHPMS | Paul and Kebarle, 1991 | gas phase; from Ph. D. thesis of S. Chowdhury, Entropy change calculated or estimated; M |
32. | 300. | PHPMS | French, Ikuta, et al., 1982 | gas phase; M |
C6H4NO2- + =
By formula: C6H4NO2- + H+ = C6H5NO2
Quantity | Value | Units | Method | Reference | Comment |
---|---|---|---|---|---|
ΔrH° | 1577. ± 13. | kJ/mol | G+TS | Cheng and Grabowski, 1989 | gas phase; between EtOH, iPrOH; B |
ΔrH° | 1482. ± 13. | kJ/mol | G+TS | Meot-ner and Kafafi, 1988 | gas phase; acidity stronger than all levels of computation by 25 kcal/mol; B |
Quantity | Value | Units | Method | Reference | Comment |
ΔrG° | 1545. ± 13. | kJ/mol | IMRB | Cheng and Grabowski, 1989 | gas phase; between EtOH, iPrOH; B |
ΔrG° | 1450. ± 13. | kJ/mol | IMRB | Meot-ner and Kafafi, 1988 | gas phase; acidity stronger than all levels of computation by 25 kcal/mol; B |
By formula: Br- + C6H5NO2 = (Br- • C6H5NO2)
Quantity | Value | Units | Method | Reference | Comment |
---|---|---|---|---|---|
ΔrH° | 62.8 ± 7.5 | kJ/mol | TDAs | Paul and Kebarle, 1991 | gas phase; ΔGaff at 423 K; B,M |
Quantity | Value | Units | Method | Reference | Comment |
ΔrS° | 84.5 | J/mol*K | N/A | Paul and Kebarle, 1991 | gas phase; Entropy change calculated or estimated; M |
Quantity | Value | Units | Method | Reference | Comment |
ΔrG° | 27. ± 4.2 | kJ/mol | TDAs | Paul and Kebarle, 1991 | gas phase; ΔGaff at 423 K; B |
Free energy of reaction
ΔrG° (kJ/mol) | T (K) | Method | Reference | Comment |
---|---|---|---|---|
27. | 423. | PHPMS | Paul and Kebarle, 1991 | gas phase; Entropy change calculated or estimated; M |
By formula: C6H7N+ + C6H5NO2 = (C6H7N+ • C6H5NO2)
Bond type: Charge transfer bond (positive ion)
Quantity | Value | Units | Method | Reference | Comment |
---|---|---|---|---|---|
ΔrH° | 74.1 | kJ/mol | PHPMS | Meot-Ner (Mautner) and El-Shall, 1986 | gas phase; M |
Quantity | Value | Units | Method | Reference | Comment |
ΔrS° | 88.7 | J/mol*K | PHPMS | Meot-Ner (Mautner) and El-Shall, 1986 | gas phase; M |
Free energy of reaction
ΔrG° (kJ/mol) | T (K) | Method | Reference | Comment |
---|---|---|---|---|
44.8 | 324. | PHPMS | Meot-Ner (Mautner) and El-Shall, 1986 | gas phase; M |
By formula: NO2- + C6H5NO2 = (NO2- • C6H5NO2)
Quantity | Value | Units | Method | Reference | Comment |
---|---|---|---|---|---|
ΔrH° | 59.4 ± 8.4 | kJ/mol | TDAs | Grimsrud, Chowdhury, et al., 1986 | gas phase; B,M |
Quantity | Value | Units | Method | Reference | Comment |
ΔrS° | 73.2 | J/mol*K | PHPMS | Grimsrud, Chowdhury, et al., 1986 | gas phase; M |
Quantity | Value | Units | Method | Reference | Comment |
ΔrG° | 37. ± 8.4 | kJ/mol | TDAs | Grimsrud, Chowdhury, et al., 1986 | gas phase; B |
By formula: C11H10+ + C6H5NO2 = (C11H10+ • C6H5NO2)
Bond type: Charge transfer bond (positive ion)
Quantity | Value | Units | Method | Reference | Comment |
---|---|---|---|---|---|
ΔrH° | 54.8 | kJ/mol | PHPMS | El-Shall and Meot-Ner (Mautner), 1987 | gas phase; M |
Quantity | Value | Units | Method | Reference | Comment |
ΔrS° | 110. | J/mol*K | PHPMS | El-Shall and Meot-Ner (Mautner), 1987 | gas phase; M |
By formula: NO- + C6H5NO2 = (NO- • C6H5NO2)
Quantity | Value | Units | Method | Reference | Comment |
---|---|---|---|---|---|
ΔrH° | 164. | kJ/mol | ICR | Reents and Freiser, 1981 | gas phase; switching reaction,Thermochemical ladder(NO+)C2H5OH, Entropy change calculated or estimated; Farid and McMahon, 1978; M |
By formula: F6S- + C6H5NO2 = (F6S- • C6H5NO2)
Quantity | Value | Units | Method | Reference | Comment |
---|---|---|---|---|---|
ΔrH° | 62.3 ± 4.2 | kJ/mol | TDAs | Chowdhury and Kebarle, 1986 | gas phase; B |
Quantity | Value | Units | Method | Reference | Comment |
ΔrG° | 28. ± 6.7 | kJ/mol | TDAs | Chowdhury and Kebarle, 1986 | gas phase; B |
By formula: F6S- + C6H5NO2 = (F6S- • C6H5NO2)
Quantity | Value | Units | Method | Reference | Comment |
---|---|---|---|---|---|
ΔrH° | 62.3 | kJ/mol | PHPMS | Chowdhury and Kebarle, 1986 | gas phase; M |
Quantity | Value | Units | Method | Reference | Comment |
ΔrS° | 115. | J/mol*K | PHPMS | Chowdhury and Kebarle, 1986 | gas phase; M |
By formula: C7F14- + C6H5NO2 = (C7F14- • C6H5NO2)
Free energy of reaction
ΔrG° (kJ/mol) | T (K) | Method | Reference | Comment |
---|---|---|---|---|
28. | 300. | PHPMS | Chowdhury and Kebarle, 1986 | gas phase; M |
+
= C13H5F14NO2-
By formula: C7F14- + C6H5NO2 = C13H5F14NO2-
Quantity | Value | Units | Method | Reference | Comment |
---|---|---|---|---|---|
ΔrG° | 28. ± 4.2 | kJ/mol | IMRE | Chowdhury and Kebarle, 1986 | gas phase; B |

Gas phase ion energetics data

Data evaluated as indicated in comments:
HL - Edward P. Hunter and Sharon G. Lias
L - Sharon G. Lias
Data compiled as indicated in comments:
B - John E. Bartmess
LBLHLM - Sharon G. Lias, John E. Bartmess, Joel F. Liebman, John L. Holmes, Rhoda D. Levin, and W. Gary Mallard
LLK - Sharon G. Lias, Rhoda D. Levin, and Sherif A. Kafafi
RDSH - Henry M. Rosenstock, Keith Draxl, Bruce W. Steiner, and John T. Herron
LL - Sharon G. Lias and Joel F. Liebman
Quantity | Value | Units | Method | Reference | Comment |
---|---|---|---|---|---|
IE (evaluated) | 9.94 ± 0.08 | eV | N/A | N/A | L |
Quantity | Value | Units | Method | Reference | Comment |
Proton affinity (review) | 800.3 | kJ/mol | N/A | Hunter and Lias, 1998 | HL |
Quantity | Value | Units | Method | Reference | Comment |
Gas basicity | 769.5 | kJ/mol | N/A | Hunter and Lias, 1998 | HL |
Electron affinity determinations
EA (eV) | Method | Reference | Comment |
---|---|---|---|
1.000 ± 0.010 | LPES | Desfrancois, Periquet, et al., 1999 | B |
1.01 ± 0.10 | TDEq | Chowdhury, Heinis, et al., 1986 | ΔGea(423 K) = -22.8 kcal/mol; ΔSea = -1.0 eu.; B |
1.00 ± 0.060 | TDAs | Chen, Wiley, et al., 1994 | B |
1.00 ± 0.020 | ECD | Chen, Chen, et al., 1992 | B |
1.019 ± 0.048 | IMRE | Fukuda and McIver, 1985 | ΔGea(355 K) = -23.1 kcal/mol; ΔSea =-1.0, est. from data in Chowdhury, Heinis, et al., 1986; B |
<1.180 ± 0.050 | PD | Mock and Grimsrud, 1989 | B |
<1.09997 | IMRB | Henglein and Muccini, 1959 | EA: < SO2; B |
>0.70 ± 0.20 | Endo | Lifshitz, Tiernan, et al., 1973 | B |
>0.39999 | ES | Compton, Christophorou, et al., 1966 | B |
Ionization energy determinations
Appearance energy determinations
Ion | AE (eV) | Other Products | Method | Reference | Comment |
---|---|---|---|---|---|
C3H3+ | 12.63 ± 0.15 | C2H2+CO+NO | PIPECO | Nishimura, Das, et al., 1986 | LBLHLM |
C4H3+ | 15.66 ± 0.15 | C2H2+NO2 | PIPECO | Nishimura, Das, et al., 1986 | LBLHLM |
C4H3+ | 11.40 ± 0.05 | NO+C2H2O | PIPECO | Panczel and Baer, 1984 | T = 298K; LBLHLM |
C4H3+ | 11.54 ± 0.05 | NO+C2H2O | PIPECO | Panczel and Baer, 1984 | T = 0K; LBLHLM |
C4H3+ | 16.31 ± 0.08 | ? | EI | Allam, Migahed, et al., 1982 | LBLHLM |
C5H5+ | 11.08 ± 0.16 | CO+NO | PIPECO | Nishimura, Das, et al., 1986 | LBLHLM |
C5H5+ | 11.30 ± 0.05 | CO+NO | PIPECO | Panczel and Baer, 1984 | T = 298K; LBLHLM |
C5H5+ | 11.44 ± 0.05 | CO+NO | PIPECO | Panczel and Baer, 1984 | T = 0K; LBLHLM |
C6H5+ | 11.51 ± 0.35 | NO2 | CAD | Katritzky, Watson, et al., 1990 | LL |
C6H5+ | 11.08 ± 0.16 | NO2 | PIPECO | Nishimura, Das, et al., 1986 | LBLHLM |
C6H5+ | 11.14 ± 0.05 | NO2 | PIPECO | Panczel and Baer, 1984 | T = 298K; LBLHLM |
C6H5+ | 11.28 ± 0.05 | NO2 | PIPECO | Panczel and Baer, 1984 | T = 0K; LBLHLM |
C6H5+ | 12.14 ± 0.08 | NO2 | EI | Allam, Migahed, et al., 1982 | LBLHLM |
C6H5+ | 9.46 ± 0.05 | NO2 | PI | Matyuk, Potapov, et al., 1979 | LLK |
C6H5+ | 11.9 ± 0.1 | NO2 | EI | Brown, 1970 | RDSH |
C6H5+ | 12.16 | ? | EI | Howe and Williams, 1969 | RDSH |
C6H5O+ | 10.68 ± 0.35 | NO | CAD | Katritzky, Watson, et al., 1990 | LL |
C6H5O+ | 10.89 ± 0.04 | NO | PIPECO | Nishimura, Das, et al., 1986 | LBLHLM |
C6H5O+ | 10.98 ± 0.05 | NO | PIPECO | Panczel and Baer, 1984 | T = 298K; LBLHLM |
C6H5O+ | 11.12 ± 0.05 | NO | PIPECO | Panczel and Baer, 1984 | T = 0K; LBLHLM |
C6H5O+ | 10.95 ± 0.05 | NO | PI | Matyuk, Potapov, et al., 1979 | LLK |
C6H5O+ | 10.4 ± 0.1 | NO | EI | Brown, 1970 | RDSH |
NO+ | 10.89 ± 0.04 | C6H5O | PIPECO | Nishimura, Das, et al., 1986 | LBLHLM |
NO+ | 11.18 ± 0.05 | C6H5O | PIPECO | Panczel and Baer, 1984 | T = 0K; LBLHLM |
NO+ | 11.04 ± 0.05 | C6H5O | PIPECO | Panczel and Baer, 1984 | T = 298K; LBLHLM |
De-protonation reactions
C6H4NO2- + =
By formula: C6H4NO2- + H+ = C6H5NO2
Quantity | Value | Units | Method | Reference | Comment |
---|---|---|---|---|---|
ΔrH° | 1577. ± 13. | kJ/mol | G+TS | Cheng and Grabowski, 1989 | gas phase; between EtOH, iPrOH; B |
ΔrH° | 1482. ± 13. | kJ/mol | G+TS | Meot-ner and Kafafi, 1988 | gas phase; acidity stronger than all levels of computation by 25 kcal/mol; B |
Quantity | Value | Units | Method | Reference | Comment |
ΔrG° | 1545. ± 13. | kJ/mol | IMRB | Cheng and Grabowski, 1989 | gas phase; between EtOH, iPrOH; B |
ΔrG° | 1450. ± 13. | kJ/mol | IMRB | Meot-ner and Kafafi, 1988 | gas phase; acidity stronger than all levels of computation by 25 kcal/mol; B |

Ion clustering data

Data compiled as indicated in comments:
B - John E. Bartmess
M - Michael M. Meot-Ner (Mautner) and Sharon G. Lias
Clustering reactions
By formula: Br- + C6H5NO2 = (Br- • C6H5NO2)
Quantity | Value | Units | Method | Reference | Comment |
---|---|---|---|---|---|
ΔrH° | 62.8 ± 7.5 | kJ/mol | TDAs | Paul and Kebarle, 1991 | gas phase; ΔGaff at 423 K; B,M |
Quantity | Value | Units | Method | Reference | Comment |
ΔrS° | 84.5 | J/mol*K | N/A | Paul and Kebarle, 1991 | gas phase; Entropy change calculated or estimated; M |
Quantity | Value | Units | Method | Reference | Comment |
ΔrG° | 27. ± 4.2 | kJ/mol | TDAs | Paul and Kebarle, 1991 | gas phase; ΔGaff at 423 K; B |
Free energy of reaction
ΔrG° (kJ/mol) | T (K) | Method | Reference | Comment |
---|---|---|---|---|
27. | 423. | PHPMS | Paul and Kebarle, 1991 | gas phase; Entropy change calculated or estimated; M |
By formula: C6H7N+ + C6H5NO2 = (C6H7N+ • C6H5NO2)
Bond type: Charge transfer bond (positive ion)
Quantity | Value | Units | Method | Reference | Comment |
---|---|---|---|---|---|
ΔrH° | 74.1 | kJ/mol | PHPMS | Meot-Ner (Mautner) and El-Shall, 1986 | gas phase; M |
Quantity | Value | Units | Method | Reference | Comment |
ΔrS° | 88.7 | J/mol*K | PHPMS | Meot-Ner (Mautner) and El-Shall, 1986 | gas phase; M |
Free energy of reaction
ΔrG° (kJ/mol) | T (K) | Method | Reference | Comment |
---|---|---|---|---|
44.8 | 324. | PHPMS | Meot-Ner (Mautner) and El-Shall, 1986 | gas phase; M |
By formula: C7F14- + C6H5NO2 = (C7F14- • C6H5NO2)
Free energy of reaction
ΔrG° (kJ/mol) | T (K) | Method | Reference | Comment |
---|---|---|---|---|
28. | 300. | PHPMS | Chowdhury and Kebarle, 1986 | gas phase; M |
+
= C13H5F14NO2-
By formula: C7F14- + C6H5NO2 = C13H5F14NO2-
Quantity | Value | Units | Method | Reference | Comment |
---|---|---|---|---|---|
ΔrG° | 28. ± 4.2 | kJ/mol | IMRE | Chowdhury and Kebarle, 1986 | gas phase; B |
By formula: C11H10+ + C6H5NO2 = (C11H10+ • C6H5NO2)
Bond type: Charge transfer bond (positive ion)
Quantity | Value | Units | Method | Reference | Comment |
---|---|---|---|---|---|
ΔrH° | 54.8 | kJ/mol | PHPMS | El-Shall and Meot-Ner (Mautner), 1987 | gas phase; M |
Quantity | Value | Units | Method | Reference | Comment |
ΔrS° | 110. | J/mol*K | PHPMS | El-Shall and Meot-Ner (Mautner), 1987 | gas phase; M |
By formula: Cl- + C6H5NO2 = (Cl- • C6H5NO2)
Quantity | Value | Units | Method | Reference | Comment |
---|---|---|---|---|---|
ΔrH° | 68.2 ± 4.2 | kJ/mol | TDAs | Chowdhury and Kebarle, 1986 | gas phase; B,M |
ΔrH° | 69.0 | kJ/mol | PHPMS | Paul and Kebarle, 1991 | gas phase; from Ph. D. thesis of S. Chowdhury, Entropy change calculated or estimated; M |
Quantity | Value | Units | Method | Reference | Comment |
ΔrS° | 84. | J/mol*K | N/A | Paul and Kebarle, 1991 | gas phase; from Ph. D. thesis of S. Chowdhury, Entropy change calculated or estimated; M |
ΔrS° | 81.2 | J/mol*K | PHPMS | Chowdhury and Kebarle, 1986 | gas phase; M |
Quantity | Value | Units | Method | Reference | Comment |
ΔrG° | 43.9 ± 6.7 | kJ/mol | TDAs | Chowdhury and Kebarle, 1986 | gas phase; B |
ΔrG° | 29.7 | kJ/mol | TDEq | French, Ikuta, et al., 1982 | gas phase; B |
Free energy of reaction
ΔrG° (kJ/mol) | T (K) | Method | Reference | Comment |
---|---|---|---|---|
43.9 | 300. | PHPMS | Paul and Kebarle, 1991 | gas phase; from Ph. D. thesis of S. Chowdhury, Entropy change calculated or estimated; M |
32. | 300. | PHPMS | French, Ikuta, et al., 1982 | gas phase; M |
By formula: F6S- + C6H5NO2 = (F6S- • C6H5NO2)
Quantity | Value | Units | Method | Reference | Comment |
---|---|---|---|---|---|
ΔrH° | 62.3 ± 4.2 | kJ/mol | TDAs | Chowdhury and Kebarle, 1986 | gas phase; B |
Quantity | Value | Units | Method | Reference | Comment |
ΔrG° | 28. ± 6.7 | kJ/mol | TDAs | Chowdhury and Kebarle, 1986 | gas phase; B |
By formula: F6S- + C6H5NO2 = (F6S- • C6H5NO2)
Quantity | Value | Units | Method | Reference | Comment |
---|---|---|---|---|---|
ΔrH° | 62.3 | kJ/mol | PHPMS | Chowdhury and Kebarle, 1986 | gas phase; M |
Quantity | Value | Units | Method | Reference | Comment |
ΔrS° | 115. | J/mol*K | PHPMS | Chowdhury and Kebarle, 1986 | gas phase; M |
By formula: NO- + C6H5NO2 = (NO- • C6H5NO2)
Quantity | Value | Units | Method | Reference | Comment |
---|---|---|---|---|---|
ΔrH° | 164. | kJ/mol | ICR | Reents and Freiser, 1981 | gas phase; switching reaction,Thermochemical ladder(NO+)C2H5OH, Entropy change calculated or estimated; Farid and McMahon, 1978; M |
By formula: NO2- + C6H5NO2 = (NO2- • C6H5NO2)
Quantity | Value | Units | Method | Reference | Comment |
---|---|---|---|---|---|
ΔrH° | 59.4 ± 8.4 | kJ/mol | TDAs | Grimsrud, Chowdhury, et al., 1986 | gas phase; B,M |
Quantity | Value | Units | Method | Reference | Comment |
ΔrS° | 73.2 | J/mol*K | PHPMS | Grimsrud, Chowdhury, et al., 1986 | gas phase; M |
Quantity | Value | Units | Method | Reference | Comment |
ΔrG° | 37. ± 8.4 | kJ/mol | TDAs | Grimsrud, Chowdhury, et al., 1986 | gas phase; B |

Condensed phase thermochemistry data

Data compiled as indicated in comments:
ALS - Hussein Y. Afeefy, Joel F. Liebman, and Stephen E. Stein
DH - Eugene S. Domalski and Elizabeth D. Hearing
Quantity | Value | Units | Method | Reference | Comment |
---|---|---|---|---|---|
ΔfH°liquid | 2.98 ± 0.13 | kcal/mol | Ccb | Lebedeva, Katin, et al., 1971 | Reanalyzed by Pedley, Naylor, et al., 1986, Original value = 2.32 ± 0.10 kcal/mol; ALS |
ΔfH°liquid | -3.9 | kcal/mol | Ccb | Swarts, 1914 | See 14SWA2; ALS |
Quantity | Value | Units | Method | Reference | Comment |
ΔcH°liquid | -738.07 ± 0.10 | kcal/mol | Ccb | Lebedeva, Katin, et al., 1971 | ALS |
ΔcH°liquid | -739.9 | kcal/mol | Ccb | Garner and Abernethy, 1921 | ALS |
ΔcH°liquid | -734.65 | kcal/mol | Ccb | Swarts, 1914 | See 14SWA2; ALS |
Quantity | Value | Units | Method | Reference | Comment |
S°liquid | 53.61 | cal/mol*K | N/A | Parks, Todd, et al., 1936 | Extrapolation below 90 K, 62.13 J/mol*K.; DH |
Constant pressure heat capacity of liquid
Cp,liquid (cal/mol*K) | Temperature (K) | Reference | Comment |
---|---|---|---|
42.38 | 303.15 | Reddy, 1986 | T = 303.15, 313.15 K.; DH |
43.291 | 298.15 | Lainez, Rodrigo, et al., 1985 | DH |
42.1 | 303. | Pacor, 1967 | DH |
43.07 | 293. | Rastorguev and Ganiev, 1967 | T = 293 to 373 K.; DH |
45.10 | 335.5 | Lutskii and Panova, 1958 | T = 62 to 141°C. Value is unsmoothed experimental datum.; DH |
43.009 | 293.15 | Mazur, 1939 | T = 5 to 20°C.; DH |
43.00 | 293. | Mazur, 1939, 2 | T = 5 to 20°C.; DH |
44.620 | 298.1 | Parks, Todd, et al., 1936 | T = 90 to 300 K.; DH |
44.630 | 298. | Parks and Todd, 1934 | T = 273 to 299 K.; DH |
42.40 | 303. | Willams and Daniels, 1924 | T = 303 to 358 K. Equation only.; DH |
42.50 | 298. | von Reis, 1881 | T = 291 to 486 K.; DH |

Phase change data

Data compiled as indicated in comments:
TRC - Thermodynamics Research Center, NIST Boulder Laboratories, Chris Muzny director
BS - Robert L. Brown and Stephen E. Stein
AC - William E. Acree, Jr., James S. Chickos
ALS - Hussein Y. Afeefy, Joel F. Liebman, and Stephen E. Stein
DH - Eugene S. Domalski and Elizabeth D. Hearing
Quantity | Value | Units | Method | Reference | Comment |
---|---|---|---|---|---|
Tboil | 484. ± 2. | K | AVG | N/A | Average of 24 out of 25 values; Individual data points |
Quantity | Value | Units | Method | Reference | Comment |
Tfus | 278.9 ± 0.2 | K | AVG | N/A | Average of 16 values; Individual data points |
Quantity | Value | Units | Method | Reference | Comment |
ΔvapH° | 13.0 | kcal/mol | CGC | Chickos, Hosseini, et al., 1995 | Based on data from 313. to 353. K.; AC |
ΔvapH° | 13.148 ± 0.0043 | kcal/mol | C | Kusano and Wadso, 1971 | ALS |
ΔvapH° | 13.1 | kcal/mol | N/A | Kusano and Wadsö, 1971 | AC |
ΔvapH° | 13.4 ± 0.41 | kcal/mol | ME | Lebedeva, Katin, et al., 1971, 2 | Based on data from 291. to 305. K.; AC |
Enthalpy of vaporization
ΔvapH (kcal/mol) | Temperature (K) | Method | Reference | Comment |
---|---|---|---|---|
13.1 | 287. | A | Stephenson and Malanowski, 1987 | Based on data from 279. to 296. K. See also Dykyj, 1972 and Lynch and Wilke, 1960.; AC |
13.0 | 303. | N/A | Zaraiskii, 1985 | Based on data from 288. to 318. K.; AC |
13.4 ± 0.10 | 291. | V | Lebedeva, Katin, et al., 1971 | ALS |
12.5 | 293. | ME | Sklyarenko, Markin, et al., 1958 | Based on data from 283. to 303. K.; AC |
11.6 | 422. | N/A | Oliver and Grisard, 1952 | Based on data from 407. to 483. K. See also Boublik, Fried, et al., 1984.; AC |
11.7 | 425. | N/A | Toral and Moles, 1933 | Based on data from 369. to 481. K.; AC |
Antoine Equation Parameters
log10(P) = A − (B / (T + C))
P = vapor pressure (atm)
T = temperature (K)
View plot Requires a JavaScript / HTML 5 canvas capable browser.
Temperature (K) | A | B | C | Reference | Comment |
---|---|---|---|---|---|
407.3 to 483.78 | 4.20982 | 1727.592 | -73.438 | Brown, 1952 | Coefficents calculated by NIST from author's data. |
Enthalpy of fusion
ΔfusH (kcal/mol) | Temperature (K) | Reference | Comment |
---|---|---|---|
2.897 | 278.8 | Domalski and Hearing, 1996 | AC |
2.5848 | 278.9 | Pacor, 1967 | DH |
2.8970 | 278.8 | Parks, Todd, et al., 1936 | DH |
Entropy of fusion
ΔfusS (cal/mol*K) | Temperature (K) | Reference | Comment |
---|---|---|---|
9.27 | 278.9 | Pacor, 1967 | DH |
10.39 | 278.8 | Parks, Todd, et al., 1936 | DH |

Henry's Law data

Data compiled by: Rolf Sander
Henry's Law constant (water solution)
kH(T) = k°H exp(d(ln(kH))/d(1/T) ((1/T) - 1/(298.15 K)))
k°H = Henry's law constant for solubility in water at 298.15 K (mol/(kg*bar))
d(ln(kH))/d(1/T) = Temperature dependence constant (K)
k°H (mol/(kg*bar)) | d(ln(kH))/d(1/T) (K) | Method | Reference |
---|---|---|---|
41. | X | N/A | |
47. | 4500. | X | N/A |
43. | V | N/A |

Normal alkane RI, non-polar column, isothermal

Data compiled by: NIST Mass Spectrometry Data Center, William E. Wallace, director

Column type PackedPackedCapillaryCapillaryCapillary
Active phase SE-30SE-30Polydimethyl siloxanePolydimethyl siloxanePolydimethyl siloxane
Column length (m) 1.51.5
Carrier gas NitrogenNitrogen
Substrate Inerton N (80-100 mesh)Inerton N (80-100 mesh)
Column diameter (mm)
Phase thickness (μm)
Temperature (C) 90.90.105.75.90.
I 1076.1081.1059.1046.1052.
ReferenceZenkevich and Ivleva, 2011Zenkevich and Ivleva, 2011Tello, Lebron-Aguilar, et al., 2009Tello, Lebron-Aguilar, et al., 2009Tello, Lebron-Aguilar, et al., 2009
Comment MSDC-RI MSDC-RI MSDC-RI MSDC-RI MSDC-RI
Column type CapillaryCapillaryCapillaryCapillary
Active phase Methyl SiliconeMethyl SiliconeMethyl SiliconeMethyl Silicone
Column length (m)
Carrier gas
Substrate
Column diameter (mm)
Phase thickness (μm)
Temperature (C) 100.120.140.80.
I 1056.1066.1076.1047.
ReferenceLebrón-Aguilar, Quintanilla-López, et al., 2007Lebrón-Aguilar, Quintanilla-López, et al., 2007Lebrón-Aguilar, Quintanilla-López, et al., 2007Lebrón-Aguilar, Quintanilla-López, et al., 2007
Comment MSDC-RI MSDC-RI MSDC-RI MSDC-RI

Normal alkane RI, polar column, custom temperature program

Data compiled by: NIST Mass Spectrometry Data Center, William E. Wallace, director

Column type CapillaryCapillary
Active phase Superox 0.6; Carbowax 20MCarbowax 400, Carbowax 20M, Carbowax 1540, Carbowax 4000, Superox 06, PEG 20M, etc.
Column length (m) 50.50.
Carrier gas HydrogenHydrogen
Substrate
Column diameter (mm) 0.320.32
Phase thickness (μm)
Program not specifiednot specified
I 1683.1683.
ReferenceWaggott and Davies, 1984Waggott and Davies, 1984
Comment MSDC-RI MSDC-RI

Lee's RI, non-polar column, temperature ramp

Data compiled by: NIST Mass Spectrometry Data Center, William E. Wallace, director

Column type Capillary
Active phase DB-5MS
Column length (m) 30.
Carrier gas
Substrate
Column diameter (mm) 0.25
Phase thickness (μm) 0.5
Tstart (C) 40.
Tend (C) 310.
Heat rate (K/min) 10.
Initial hold (min) 1.
Final hold (min)
I 180.05
ReferenceChen, Keeran, et al., 2002
Comment MSDC-RI

References

Lebedeva, Katin, et al., 1971
Lebedeva, N.D.; Katin, Y.A.; Akhmedova, G.Y.,
Standard enthalpy of formation of nitrobenzene,
Russ. J. Phys. Chem. (Engl. Transl.), 1971, 45, 1192-1193. [all data]
Pedley, Naylor, et al., 1986
Pedley, J.B.; Naylor, R.D.; Kirby, S.P.,
Thermochemical Data of Organic Compounds, Chapman and Hall, New York, 1986, 1-792. [all data]
Chowdhury and Kebarle, 1986
Chowdhury, S.; Kebarle, P.,
Role of Binding Energies in A-.B and A.B- Complexes in the Kinetics of Gas Phase Electron Transfer Reactions:A- + B = A + B- Involving Perfluoro Compounds: SF6, C6F11CF3,
J. Chem. Phys., 1986, 85, 9, 4989, https://doi.org/10.1063/1.451687
. [all data]
Paul and Kebarle, 1991
Paul, G.J.C.; Kebarle, P.,
Stabilities of Complexes of Br- with Substituted Benzenes (SB) Based on Determinations of the Gas-Phase Equilibria Br- + SB = (BrSB)-,
J. Am. Chem. Soc., 1991, 113, 4, 1148, https://doi.org/10.1021/ja00004a014
. [all data]
French, Ikuta, et al., 1982
French, M.A.; Ikuta, S.; Kebarle, P.,
Hydrogen bonding of O-H and C-H hydrogen donors to Cl-. Results from mass spectrometric measurement of the ion-molecule equilibria RH + Cl- = RHCl-,
Can. J. Chem., 1982, 60, 1907. [all data]
Cheng and Grabowski, 1989
Cheng, X.; Grabowski, J.J.,
Gas-phase Acidity of Nitrobenzene from Flowing Afterglow Bracketing Studies,
Rapid Commun. Mass Spectrom., 1989, 3, 2, 34-36, https://doi.org/10.1002/rcm.1290030207
. [all data]
Meot-ner and Kafafi, 1988
Meot-ner, M.; Kafafi, S.A.,
Carbon Acidities of Aromatic Compounds,
J. Am. Chem. Soc., 1988, 110, 19, 6297, https://doi.org/10.1021/ja00227a003
. [all data]
Meot-Ner (Mautner) and El-Shall, 1986
Meot-Ner (Mautner), M.; El-Shall, M.S.,
Ionic Charge Transfer Complexes. 1. Cationic Complexes with Delocalized and Partially Localized pi Systems,
J. Am. Chem. Soc., 1986, 108, 15, 4386, https://doi.org/10.1021/ja00275a026
. [all data]
Grimsrud, Chowdhury, et al., 1986
Grimsrud, E.P.; Chowdhury, S.; Kebarle, P.,
Gas Phase Reactions of NO2- with Nitrobenzenes and Quinones. Electron Transfer, Clusters, and Formation of Phenoxide and Quinoxide Negative Ions. Use of NO2 as a NICI Reagent Gas.,
Int. J. Mass Spectrom. Ion Proc., 1986, 68, 1-2, 57, https://doi.org/10.1016/0168-1176(86)87068-9
. [all data]
El-Shall and Meot-Ner (Mautner), 1987
El-Shall, M.S.; Meot-Ner (Mautner), M.,
Ionic Charge Transfer Complexes. 3. Delocalised pi Systems as Electron Acceptors and Donors,
J. Phys. Chem., 1987, 91, 5, 1088, https://doi.org/10.1021/j100289a017
. [all data]
Reents and Freiser, 1981
Reents, W.D.; Freiser, B.S.,
Gas-Phase Binding Energies and Spectroscopic Properties of NO+ Charge-Transfer Complexes,
J. Am. Chem. Soc., 1981, 103, 2791. [all data]
Farid and McMahon, 1978
Farid, R.; McMahon, T.B.,
Gas-Phase Ion-Molecule Reactions of Alkyl Nitrites by Ion Cyclotron Resonance Spectroscopy,
Int. J. Mass Spectrom. Ion Phys., 1978, 27, 2, 163, https://doi.org/10.1016/0020-7381(78)80037-0
. [all data]
Hunter and Lias, 1998
Hunter, E.P.; Lias, S.G.,
Evaluated Gas Phase Basicities and Proton Affinities of Molecules: An Update,
J. Phys. Chem. Ref. Data, 1998, 27, 3, 413-656, https://doi.org/10.1063/1.556018
. [all data]
Desfrancois, Periquet, et al., 1999
Desfrancois, C.; Periquet, V.; Lyapustina, S.A.; Lippa, T.P.; Robinson, D.W.; Bowen, K.H.; Nonaka, H.; Compton,
Electron Binding to Valence and Multipole states of Molecules: Nitrobenzene, para- and meta-dinitrobenzenes,
J. Chem. Phys., 1999, 111, 10, 4569, https://doi.org/10.1063/1.479218
. [all data]
Chowdhury, Heinis, et al., 1986
Chowdhury, S.; Heinis, T.; Grimsrud, E.P.; Kebarle, P.,
Entropy Changes and Electron Affinities from Gas-Phase Electron Transfer Equilibria: A- + B = A + B-,
J. Phys. Chem., 1986, 90, 12, 2747, https://doi.org/10.1021/j100403a037
. [all data]
Chen, Wiley, et al., 1994
Chen, E.C.M.; Wiley, J.R.; Batten, C.F.; Wentworth, W.E.,
Determination of the Electron Affinities of Molecules Using Negative Ion Mass Spectrometry,
J. Phys. Chem., 1994, 98, 1, 88, https://doi.org/10.1021/j100052a016
. [all data]
Chen, Chen, et al., 1992
Chen, E.C.M.; Chen, E.S.; Milligan, M.S.; Wentworth, W.E.; Wiley, J.R.,
Experimental Determination of the Electron Affinities of Nitrobenzene, Nitrotoluenes, Pentafluoronitrobenzene, and Isotopic Nitrobenzenes an,
J. Phys. Chem., 1992, 96, 5, 2385, https://doi.org/10.1021/j100184a069
. [all data]
Fukuda and McIver, 1985
Fukuda, E.K.; McIver, R.T., Jr.,
Relative electron affinities of substituted benzophenones, nitrobenzenes, and quinones. [Anchored to EA(SO2) from 74CEL/BEN],
J. Am. Chem. Soc., 1985, 107, 2291. [all data]
Mock and Grimsrud, 1989
Mock, R.S.; Grimsrud, E.P.,
Gas-Phase Electron Photodetachment Spectroscopy of the Molecular Anions of Nitroaromatic Hydrocarbons at Atmospheric Pressure,
J. Am. Chem. Soc., 1989, 111, 8, 2861, https://doi.org/10.1021/ja00190a020
. [all data]
Henglein and Muccini, 1959
Henglein, A.; Muccini, G.A.,
Negative Ion-Molecule Reactions,
J. Chem. Phys., 1959, 31, 5, 1426, https://doi.org/10.1063/1.1730618
. [all data]
Lifshitz, Tiernan, et al., 1973
Lifshitz, C.; Tiernan, T.O.; Hughes, B.M.,
Electron affinities from endothermic negative-ion charge transfer reactions. IV. SF6, selected fluorocarbons, and other polyatomic molecules,
J. Chem. Phys., 1973, 59, 3182. [all data]
Compton, Christophorou, et al., 1966
Compton, R.N.; Christophorou, L.G.; Hurst, G.S.; Reinhardt, P.W.,
Nondissociative Electron Capture in Complex Molecules and Negative Ion Lifetimes,
J. Chem. Phys., 1966, 45, 12, 4634, https://doi.org/10.1063/1.1727547
. [all data]
Klasinc, Kovac, et al., 1983
Klasinc, L.; Kovac, B.; Gusten, H.,
Photoelectron spectra of acenes. Electronic structure and substituent effects,
Pure Appl. Chem., 1983, 55, 289. [all data]
Katsumata, Shiromaru, et al., 1982
Katsumata, S.; Shiromaru, H.; Mitani, K.; Iwata, S.; Kimura, K.,
Photoelectron angular distribution and assignments of photoelectron spectra of nitrogen dioxide, nitromethane and nitrobenzene,
Chem. Phys., 1982, 69, 423. [all data]
Allam, Migahed, et al., 1982
Allam, S.H.; Migahed, M.D.; El-Khodary, A.,
Electron impact ionization and dissociation of deuterated and non-deuterated methanol, methyl cyanide, nitromethane and nitrobenzene,
Egypt. J. Phys., 1982, 13, 167. [all data]
Kimura, Katsumata, et al., 1981
Kimura, K.; Katsumata, S.; Achiba, Y.; Yamazaki, T.; Iwata, S.,
Ionization energies, Ab initio assignments, and valence electronic structure for 200 molecules
in Handbook of HeI Photoelectron Spectra of Fundamental Organic Compounds, Japan Scientific Soc. Press, Tokyo, 1981. [all data]
Allam, Migahed, et al., 1981
Allam, S.H.; Migahed, M.D.; El Khodary, A.,
Electron impact study of nitrobenzene and nitromethane,
Int. J. Mass Spectrom. Ion Phys., 1981, 39, 117. [all data]
Matyuk, Potapov, et al., 1979
Matyuk, V.M.; Potapov, V.K.; Prokhoda, A.L.,
Photoexcitation and photoionisation of nitro- derivatives of benzene and toluene,
Russ. J. Phys. Chem., 1979, 53, 538. [all data]
Behan, Johnstone, et al., 1976
Behan, J.M.; Johnstone, R.A.W.; Bentley, T.W.,
An evaluation of empirical methods for calculating the ionization potentials of substituted benzenes,
Org. Mass Spectrom., 1976, 11, 207. [all data]
McLafferty, Bente, et al., 1973
McLafferty, F.W.; Bente, P.F., III; Kornfeld, R.; Tsai, S.-C.; Howe, I.,
Collisional activation spectra of organic ions,
J. Am. Chem. Soc., 1973, 95, 2120. [all data]
Khalil, Meeks, et al., 1973
Khalil, O.S.; Meeks, J.L.; McGlynn, S.P.,
Electronic spectroscopy of highly polar aromatics. VII. Photoelectron spectra of nitroanilines,
J. Am. Chem. Soc., 1973, 95, 5876. [all data]
Rabalais, 1972
Rabalais, J.W.,
Photoelectron spectroscopic investigation of the electronic structure of nitromethane and nitrobenzene,
J. Chem. Phys., 1972, 57, 960. [all data]
Kotov and Potapov, 1972
Kotov, B.V.; Potapov, V.K.,
Ionization potentials of strong organic electron acceptors,
Khim. Vys. Energ., 1972, 6, 375. [all data]
Johnstone and Mellon, 1972
Johnstone, R.A.W.; Mellon, F.A.,
Electron-impact ionization and appearance potentials,
J. Chem. Soc. Faraday Trans. 2, 1972, 68, 1209. [all data]
Johnstone, Mellon, et al., 1971
Johnstone, R.A.W.; Mellon, F.A.; Ward, S.D.,
On-line computer methods used in conjunction with the measurement of ionization appearance potentials,
Adv. Mass Spectrom., 1971, 5, 334. [all data]
Johnstone, Mellon, et al., 1970
Johnstone, R.A.W.; Mellon, F.A.; Ward, S.D.,
Online acquisition of ionization efficiency data,
Intern. J. Mass Spectrom. Ion Phys., 1970, 5, 241. [all data]
Buchs, 1970
Buchs, A.,
Etude par spectrometrie de masse de l'ionisation de benzonitriles, de phenylacetonitriles et de N,N-dimethylanilines substitues,
Helv. Chim. Acta, 1970, 53, 2026. [all data]
Brown, 1970
Brown, P.,
Kinetic studies in mass spectrometry. IX. Competing [M-NO2] and [M-NO] reactions in substituted nitrobenzenes. Approximate activation energies from ionization and appearance potentials,
Org. Mass Spectrom., 1970, 4, 533. [all data]
Watanabe, Nakayama, et al., 1962
Watanabe, K.; Nakayama, T.; Mottl, J.,
Ionization potentials of some molecules,
J. Quant. Spectry. Radiative Transfer, 1962, 2, 369. [all data]
Palmer, Moyes, et al., 1979
Palmer, M.H.; Moyes, W.; Spiers, M.; Ridyard, J.N.A.,
The electronic structure of substituted benzenes; ab initio calculations and photoelectron spectra for nitrobenzene, the nitrotoluenes, dinitrobenzenes and fluoronitrobenzenes,
J. Mol. Struct., 1979, 55, 243. [all data]
Kobayashi, 1978
Kobayashi, T.,
A simple general tendency in photoelectron angular distributions of some monosubstituted benzenes,
Phys. Lett., 1978, 69, 105. [all data]
Rao, 1975
Rao, C.N.R.,
Lone-pair ionization bands of chromophores in the photoelectron spectra of organic molecules,
Indian J. Chem., 1975, 13, 950. [all data]
Kobayashi and Nagakura, 1974
Kobayashi, T.; Nagakura, S.,
Photoelectron spectra of substituted benzenes,
Bull. Chem. Soc. Jpn., 1974, 47, 2563. [all data]
Gol'denfel'd, Korostyshevskii, et al., 1973
Gol'denfel'd, I.V.; Korostyshevskii, I.Z.; Mischanchuk, B.G.; Pokrovskii, V.A.,
Determination of ionization potentials of atoms and molecules using a field mass spectrometer equipped with an energy analyzer,
Dokl. Akad. Nauk SSSR, 1973, 213, 626. [all data]
Kobayashi and Nagakura, 1972
Kobayashi, T.; Nagakura, S.,
Photoelectron spectra of nitro-compounds,
Chem. Lett., 1972, 903. [all data]
Baker, May, et al., 1968
Baker, A.D.; May, D.P.; Turner, D.W.,
Molecular photoelectron spectroscopy. Part VII. The vertical ionisation potentials of benzene and some of its monosubstituted and 1,4-disubstituted derivatives,
J. Chem. Soc. B, 1968, 22. [all data]
Nishimura, Das, et al., 1986
Nishimura, T.; Das, P.R.; Meisels, G.G.,
On the dissociation dynamics of energy-selected nitrobenzene ion,
J. Chem. Phys., 1986, 84, 6190. [all data]
Panczel and Baer, 1984
Panczel, M.; Baer, T.,
A photoelectron photoion coincidence (PEPICO) study of fragmentation rates and linetic energy release distributions in nitrobenzene,
Int. J. Mass Spectrom. Ion Processes, 1984, 58, 43. [all data]
Katritzky, Watson, et al., 1990
Katritzky, A.R.; Watson, C.H.; Dega-Szafran, Z.; Eyler, J.R.,
Collisionally activated dissociation of N-alkylpyridinium cations to pyridine and alkyl cations in the gas phase,
J. Am. Chem. Soc., 1990, 112, 2471. [all data]
Howe and Williams, 1969
Howe, I.; Williams, D.H.,
Calculation and qualitative predictions of mass spectra. Mono- and paradisubstituted benzenes,
J. Am. Chem. Soc., 1969, 91, 7137. [all data]