Niacinamide
- Formula: C6H6N2O
- Molecular weight: 122.1246
- IUPAC Standard InChIKey: DFPAKSUCGFBDDF-UHFFFAOYSA-N
- CAS Registry Number: 98-92-0
- Chemical structure:
View 3d structure (requires JavaScript / HTML 5) - Other names: 3-Pyridinecarboxamide; Nicotinamide; β-Pyridinecarboxamide; Aminicotin; Benicot; Delonin Amide; Dipegyl; Niavit PP; Nicamina; Nicamindon; Nicasir; Nicobion; Nicofort; Nicosan 2; Nicosylamide; Nicotamide; Nicotilamide; Nicotine acid amide; Nicotinic acid amide; Nicotinic amide; Nicotylamide; Nicovit; Nicovitina; Nikotinamid; Niocinamide; Niozymin; NAM; Pelmine; Pelonin Amide; Pyridine, 3-carbamoyl-; Vi-Nicotyl; Vitamin B; Vitamin B3; 3-Carbamoylpyridine; 3-Pyridinecarboxylic acid amide; Acid amide; Amide PP; Amixicotyn; Austrovit PP; Endobion; Factor PP; Hansamid; Inovitan PP; Nandervit-N; Niacevit; Niamide; Nicamide; Nicogen; Nicomidol; Nicota; Nicotililamido; Nicotinsaureamid; Nicotol; Nicovel; Nicovitol; Nicozymin; Niko-tamin; Nikotinsaeureamid; Pelmin; Pyridine-3-carboxylic acid amide; PP-Faktor; Savacotyl; Vitamin PP; Witamina PP; Amid kyseliny nikotinove; Amnicotin; Dipigyl; Vi-noctyl; b-Pyridinecarboxamide; 3-(Aminocarbonyl)pyridine; 3-Amidopyridine; Nictoamide; Papulex

Condensed phase thermochemistry data

Data compiled by: Hussein Y. Afeefy, Joel F. Liebman, and Stephen E. Stein
Quantity | Value | Units | Method | Reference | Comment |
---|---|---|---|---|---|
ΔfH°solid | -134.9 ± 1.7 | kJ/mol | Ccb | Ryskalieva, Erkasov, et al., 1993 | |
Quantity | Value | Units | Method | Reference | Comment |
ΔcH°solid | -3083.8 ± 1.7 | kJ/mol | Ccb | Ryskalieva, Erkasov, et al., 1993 |

Phase change data

Data compiled as indicated in comments:
TRC - Thermodynamics Research Center, NIST Boulder Laboratories, Chris Muzny director
AC - William E. Acree, Jr., James S. Chickos
Quantity | Value | Units | Method | Reference | Comment |
---|---|---|---|---|---|
Tfus | 401.95 | K | N/A | Malaviolle, De Maury, et al., 1987 | Uncertainty assigned by TRC = 0.5 K; determined for various conditions and heating rates; TRC |
Tfus | 402. | K | N/A | Grady, Hays, et al., 1973 | Uncertainty assigned by TRC = 1. K; TRC |
Quantity | Value | Units | Method | Reference | Comment |
ΔsubH° | 121.2 ± 3.3 | kJ/mol | C | Ribeiro da Silva, Gonçalves, et al., 2001 | AC |
Enthalpy of sublimation
ΔsubH (kJ/mol) | Temperature (K) | Method | Reference | Comment |
---|---|---|---|---|
111.8 | 378. | ME | Stephenson and Malanowski, 1987 | Based on data from 363. to 393. K. See also Negoro, Miki, et al., 1960 and Harutada, 1959.; AC |
Enthalpy of fusion
ΔfusH (kJ/mol) | Temperature (K) | Method | Reference | Comment |
---|---|---|---|---|
23.8 | 403.8 | DSC | Good and Rodriguez-Hornedo, 2009 | AC |
25.5 | 401.6 | DSC | Nicoli, Bilzi, et al., 2008 | AC |
26.94 | 402. | N/A | Negoro, Miki, et al., 1960, 2 | AC |

Gas phase ion energetics data

Data evaluated as indicated in comments:
HL - Edward P. Hunter and Sharon G. Lias
Data compiled as indicated in comments:
LLK - Sharon G. Lias, Rhoda D. Levin, and Sherif A. Kafafi
Quantity | Value | Units | Method | Reference | Comment |
---|---|---|---|---|---|
Proton affinity (review) | 918.3 | kJ/mol | N/A | Hunter and Lias, 1998 | HL |
Quantity | Value | Units | Method | Reference | Comment |
Gas basicity | 886.4 | kJ/mol | N/A | Hunter and Lias, 1998 | HL |
Ionization energy determinations
IE (eV) | Method | Reference | Comment |
---|---|---|---|
9.18 | PE | Dougherty, Younathan, et al., 1978 | LLK |

Van Den Dool and Kratz RI, non-polar column, temperature ramp

Data compiled by: NIST Mass Spectrometry Data Center, William E. Wallace, director

Column type Capillary
Active phase DB-5
Column length (m) 30.
Carrier gas He
Substrate
Column diameter (mm) 0.32
Phase thickness (μm)
Tstart (C) 60.
Tend (C) 280.
Heat rate (K/min) 10.
Initial hold (min) 10.
Final hold (min) 3.
I 1426.
ReferencePremecz and Ford, 1987
Comment MSDC-RI

References

Ryskalieva, Erkasov, et al., 1993
Ryskalieva, A.K.; Erkasov, R.S.; Abramova, G.V.; Nurakhmetov, N.N.,
Enthalpies of combustion of nicotinamide and its nitrate,
Izv. Vyssh. Uchebn. Zaved., Khim. Khim. Tekhnol., 1993, 36, 112-114. [all data]
Malaviolle, De Maury, et al., 1987
Malaviolle, R.; De Maury, G.; Chauvet, A.; Terol, A.; Masse, J.,
Study of the Binaries Khelline I - Nicotinic Acid and Khelline I - Nicotinamide,
Thermochim. Acta, 1987, 121, 283. [all data]
Grady, Hays, et al., 1973
Grady, L.T.; Hays, S.E.; King, R.H.; Klein, H.R.; Mader, W.J.; Wyatt, D.K.; Zimmere, R.O.,
Drug purity profiles,
J. Pharm. Sci., 1973, 62, 459. [all data]
Ribeiro da Silva, Gonçalves, et al., 2001
Ribeiro da Silva, Maria D.M.C.; Gonçalves, Jorge M.; Ferreira, Susana C.C.; da Silva, Luís C.M.; Sottomayor, M.J.; Pilcher, G.; Acree Jr, William E.; Roy, Lindsay E.,
Experimental thermochemical study of the enthalpies of formation and sublimation of isonicotinamide, picolinamide, nicotinamide, isonicotinamideN-oxide, and nicotinamideN-oxide. The dissociation enthalpies of the N--O bonds,
The Journal of Chemical Thermodynamics, 2001, 33, 10, 1263-1275, https://doi.org/10.1006/jcht.2001.0839
. [all data]
Stephenson and Malanowski, 1987
Stephenson, Richard M.; Malanowski, Stanislaw,
Handbook of the Thermodynamics of Organic Compounds, 1987, https://doi.org/10.1007/978-94-009-3173-2
. [all data]
Negoro, Miki, et al., 1960
Negoro, H.; Miki, T.; Ueda, S.,
Yakugaku Zasshi, 1960, 80, 665. [all data]
Harutada, 1959
Harutada, N.,
Takamine Kenkyusho Nempo, 1959, 11, 66. [all data]
Good and Rodriguez-Hornedo, 2009
Good, David J.; Rodriguez-Hornedo, Nair,
Solubility Advantage of Pharmaceutical Cocrystals,
Crystal Growth & Design, 2009, 9, 5, 2252-2264, https://doi.org/10.1021/cg801039j
. [all data]
Nicoli, Bilzi, et al., 2008
Nicoli, S.; Bilzi, S.; Santi, P.; Caira, M.R.; Li, J.; Bettini, R.,
Ethyl-paraben and nicotinamide mixtures: Apparent solubility, thermal behavior and X-ray structure of the 1:1 co-crystal,
J. Pharm. Sci., 2008, 97, 11, 4830-4839, https://doi.org/10.1002/jps.21341
. [all data]
Negoro, Miki, et al., 1960, 2
Negoro, H.; Miki, T.; Ueda, S.; Sanada, T.; Okada, R.,
Yakugaku Zasshi, 1960, 80, 670. [all data]
Hunter and Lias, 1998
Hunter, E.P.; Lias, S.G.,
Evaluated Gas Phase Basicities and Proton Affinities of Molecules: An Update,
J. Phys. Chem. Ref. Data, 1998, 27, 3, 413-656, https://doi.org/10.1063/1.556018
. [all data]
Dougherty, Younathan, et al., 1978
Dougherty, D.; Younathan, E.S.; Voll, R.; Abdulnur, S.; McGlynn, S.P.,
Photoelectron spectroscopy of some biological molecules,
J. Electron Spectrosc. Relat. Phenom., 1978, 13, 379. [all data]