Benzenecarbothioic acid
- Formula: C7H6OS
- Molecular weight: 138.187
- IUPAC Standard InChIKey: UIJGNTRUPZPVNG-UHFFFAOYSA-N
- CAS Registry Number: 98-91-9
- Chemical structure:
View 3d structure (requires JavaScript / HTML 5) - Other names: Benzoic acid, thio-; Benzoyl thiol; Monothiobenzoic acid; Thiobenzoic acid; Acido mercaptobenzoico

Gas phase ion energetics data

Data compiled by: Sharon G. Lias, Rhoda D. Levin, and Sherif A. Kafafi
Ionization energy determinations
IE (eV) | Method | Reference | Comment |
---|---|---|---|
9.0 | PE | Meeks, Wahlborg, et al., 1981 | |
9.6 | PE | Meeks, Wahlborg, et al., 1981 | Vertical value |

References

Meeks, Wahlborg, et al., 1981
Meeks, J.; Wahlborg, A.; McGlynn, S.P.,
Photoelectron spectroscopy of carbonyls: Benzoic acid and its derivatives,
J. Electron Spectrosc. Relat. Phenom., 1981, 22, 43. [all data]