α-Methylstyrene
- Formula: C9H10
- Molecular weight: 118.1757
- IUPAC Standard InChIKey: XYLMUPLGERFSHI-UHFFFAOYSA-N
- CAS Registry Number: 98-83-9
- Chemical structure:

Gas phase thermochemistry data

Data compiled as indicated in comments:
ALS - Hussein Y. Afeefy, Joel F. Liebman, and Stephen E. Stein
GT - Glushko Thermocenter, Russian Academy of Sciences, Moscow
Quantity | Value | Units | Method | Reference | Comment |
---|---|---|---|---|---|
ΔfH°gas | 118.3 ± 1.4 | kJ/mol | Eqk | Guthrie, 1978 | ALS |
Quantity | Value | Units | Method | Reference | Comment |
ΔcH°gas | -5083.77 | kJ/mol | Ccb | Krall and Roberts, 1958 | Corresponding ΔfHºgas = 113.0 kJ/mol (simple calculation by NIST; no Washburn corrections); ALS |
Constant pressure heat capacity of gas
Cp,gas (J/mol*K) | Temperature (K) | Reference | Comment |
---|---|---|---|
45.52 | 50. | Thermodynamics Research Center, 1997 | p=1 bar.; GT |
57.42 | 100. | ||
73.78 | 150. | ||
94.14 | 200. | ||
128.36 | 273.15 | ||
140.49 | 298.15 | ||
141.38 | 300. | ||
187.68 | 400. | ||
227.07 | 500. | ||
259.1 | 600. | ||
285.1 | 700. | ||
306.5 | 800. | ||
324.3 | 900. | ||
339.3 | 1000. | ||
352.0 | 1100. | ||
362.7 | 1200. | ||
371.9 | 1300. | ||
379.8 | 1400. | ||
386.5 | 1500. |

Condensed phase thermochemistry data

Data compiled as indicated in comments:
ALS - Hussein Y. Afeefy, Joel F. Liebman, and Stephen E. Stein
DH - Eugene S. Domalski and Elizabeth D. Hearing
Quantity | Value | Units | Method | Reference | Comment |
---|---|---|---|---|---|
ΔcH°liquid | -5041.18 | kJ/mol | Ccb | Roberts and Jessup, 1951 | Corresponding ΔfHºliquid = 70.42 kJ/mol (simple calculation by NIST; no Washburn corrections); ALS |
ΔcH°liquid | -5093.2 | kJ/mol | Ccb | Lemoult, 1911 | Corresponding ΔfHºliquid = 123. kJ/mol (simple calculation by NIST; no Washburn corrections); ALS |
ΔcH°liquid | -5000.3 | kJ/mol | Ccb | Auwsers, Roth, et al., 1910 | Corresponding ΔfHºliquid = 30. kJ/mol (simple calculation by NIST; no Washburn corrections); ALS |
Quantity | Value | Units | Method | Reference | Comment |
S°liquid | 243.8 | J/mol*K | N/A | Lebedev and Rabinovich, 1971 | DH |
Constant pressure heat capacity of liquid
Cp,liquid (J/mol*K) | Temperature (K) | Reference | Comment |
---|---|---|---|
202.2 | 300. | Lebedev and Rabinovich, 1971 | T = 60 to 300 K.; DH |

Phase change data

Data compiled as indicated in comments:
BS - Robert L. Brown and Stephen E. Stein
TRC - Thermodynamics Research Center, NIST Boulder Laboratories, Chris Muzny director
AC - William E. Acree, Jr., James S. Chickos
DH - Eugene S. Domalski and Elizabeth D. Hearing
Quantity | Value | Units | Method | Reference | Comment |
---|---|---|---|---|---|
Tboil | 438. ± 4. | K | AVG | N/A | Average of 15 out of 16 values; Individual data points |
Quantity | Value | Units | Method | Reference | Comment |
Tfus | 249.05 | K | N/A | Anonymous, 1952 | Uncertainty assigned by TRC = 0.3 K; TRC |
Tfus | 247.22 | K | N/A | Anonymous, 1946 | Uncertainty assigned by TRC = 0.6 K; TRC |
Tfus | 249.94 | K | N/A | Stull, 1945 | Uncertainty assigned by TRC = 0.25 K; TRC |
Tfus | 244.83 | K | N/A | Anonymous, 1943 | Uncertainty assigned by TRC = 0.4 K; TRC |
Quantity | Value | Units | Method | Reference | Comment |
Tc | 645. | K | N/A | Steele, Chirico, et al., 1997 | Uncertainty assigned by TRC = 6. K; TRC |
Quantity | Value | Units | Method | Reference | Comment |
Pc | 35.50 | bar | N/A | Steele, Chirico, et al., 1997 | Uncertainty assigned by TRC = 3.00 bar; derived from fit of obs. vapor pressure; TRC |
Quantity | Value | Units | Method | Reference | Comment |
ρc | 2.44 | mol/l | N/A | Steele, Chirico, et al., 1997 | Uncertainty assigned by TRC = 0.13 mol/l; TRC |
Quantity | Value | Units | Method | Reference | Comment |
ΔvapH° | 48.9 ± 0.3 | kJ/mol | GS | Verevkin, 1999 | Based on data from 274. to 314. K.; AC |
ΔvapH° | 48.6 ± 0.4 | kJ/mol | EB | Steele, Chirico, et al., 1997, 2 | Based on data from 331. to 467. K.; AC |
Enthalpy of vaporization
ΔvapH (kJ/mol) | Temperature (K) | Method | Reference | Comment |
---|---|---|---|---|
49.2 ± 0.3 | 294. | GS | Verevkin, 1999 | Based on data from 274. to 314. K.; AC |
45.9 ± 0.3 | 340. | EB | Steele, Chirico, et al., 1997, 2 | Based on data from 331. to 467. K.; AC |
43.3 ± 0.3 | 380. | EB | Steele, Chirico, et al., 1997, 2 | Based on data from 331. to 467. K.; AC |
40.6 ± 0.3 | 420. | EB | Steele, Chirico, et al., 1997, 2 | Based on data from 331. to 467. K.; AC |
37.7 ± 0.5 | 460. | EB | Steele, Chirico, et al., 1997, 2 | Based on data from 331. to 467. K.; AC |
44.3 | 358. | A | Stephenson and Malanowski, 1987 | Based on data from 343. to 493. K.; AC |
44.8 | 368. | A | Stephenson and Malanowski, 1987 | Based on data from 353. to 413. K.; AC |
Antoine Equation Parameters
log10(P) = A − (B / (T + C))
P = vapor pressure (bar)
T = temperature (K)
View plot Requires a JavaScript / HTML 5 canvas capable browser.
Temperature (K) | A | B | C | Reference | Comment |
---|---|---|---|---|---|
280.6 to 438.6 | 5.21967 | 2326.867 | 7.23 | Stull, 1947 | Coefficents calculated by NIST from author's data. |
Enthalpy of fusion
ΔfusH (kJ/mol) | Temperature (K) | Reference | Comment |
---|---|---|---|
11.924 | 250.78 | Lebedev and Rabinovich, 1971 | DH |
11.92 | 250.8 | Domalski and Hearing, 1996 | AC |
Entropy of fusion
ΔfusS (J/mol*K) | Temperature (K) | Reference | Comment |
---|---|---|---|
47.55 | 250.78 | Lebedev and Rabinovich, 1971 | DH |

Reaction thermochemistry data

Data compiled as indicated in comments:
ALS - Hussein Y. Afeefy, Joel F. Liebman, and Stephen E. Stein
B - John E. Bartmess
Individual Reactions
By formula: HCl + C9H10 = C9H11Cl
Quantity | Value | Units | Method | Reference | Comment |
---|---|---|---|---|---|
ΔrH° | -36.8 ± 1.9 | kJ/mol | Cm | Arnett and Pienta, 1980 | liquid phase; solvent: Methylene chloride; Hydrochlorination; ALS |
ΔrH° | -51.9 ± 4.6 | kJ/mol | Cm | Nesterova, Kovzel, et al., 1977 | liquid phase; Hydrochlorination; ALS |
C9H9- + =
By formula: C9H9- + H+ = C9H10
Quantity | Value | Units | Method | Reference | Comment |
---|---|---|---|---|---|
ΔrH° | 1613. ± 23. | kJ/mol | G+TS | Bartmess and Burnham, 1984 | gas phase; between H2O, MeOH; B |
Quantity | Value | Units | Method | Reference | Comment |
ΔrG° | 1586. ± 23. | kJ/mol | IMRB | Bartmess and Burnham, 1984 | gas phase; between H2O, MeOH; B |
By formula: H2 + C9H10 = C9H12
Quantity | Value | Units | Method | Reference | Comment |
---|---|---|---|---|---|
ΔrH° | -111.3 ± 2.1 | kJ/mol | Chyd | Abboud, Jimenez, et al., 1995 | liquid phase; solvent: Hyrocarbon; Like gas phase; ALS |
By formula: HBr + C9H10 = C9H11Br
Quantity | Value | Units | Method | Reference | Comment |
---|---|---|---|---|---|
ΔrH° | -63.6 ± 5.4 | kJ/mol | Cm | Nesterova, Kovzel, et al., 1977 | liquid phase; Hydrobromination; ALS |

Gas phase ion energetics data

Data evaluated as indicated in comments:
HL - Edward P. Hunter and Sharon G. Lias
Data compiled as indicated in comments:
B - John E. Bartmess
LBLHLM - Sharon G. Lias, John E. Bartmess, Joel F. Liebman, John L. Holmes, Rhoda D. Levin, and W. Gary Mallard
LLK - Sharon G. Lias, Rhoda D. Levin, and Sherif A. Kafafi
RDSH - Henry M. Rosenstock, Keith Draxl, Bruce W. Steiner, and John T. Herron
Quantity | Value | Units | Method | Reference | Comment |
---|---|---|---|---|---|
Proton affinity (review) | 864.2 | kJ/mol | N/A | Hunter and Lias, 1998 | HL |
Quantity | Value | Units | Method | Reference | Comment |
Gas basicity | 835.3 | kJ/mol | N/A | Hunter and Lias, 1998 | HL |
Ionization energy determinations
IE (eV) | Method | Reference | Comment |
---|---|---|---|
8.3 ± 0.1 | EI | Koppel, Schwarz, et al., 1974 | LLK |
8.18 ± 0.04 | EI | Benito, Seidl, et al., 1973 | LLK |
8.35 ± 0.01 | PI | Watanabe, Nakayama, et al., 1962 | RDSH |
8.50 | PE | Chizhov, Timoshenko, et al., 1986 | Vertical value; LBLHLM |
8.52 | PE | Kobayashi, Yokota, et al., 1973 | Vertical value; LLK |
Appearance energy determinations
Ion | AE (eV) | Other Products | Method | Reference | Comment |
---|---|---|---|---|---|
C9H9+ | 11.8 ± 0.1 | H | EI | Koppel, Schwarz, et al., 1974 | LLK |
De-protonation reactions
C9H9- + =
By formula: C9H9- + H+ = C9H10
Quantity | Value | Units | Method | Reference | Comment |
---|---|---|---|---|---|
ΔrH° | 1613. ± 23. | kJ/mol | G+TS | Bartmess and Burnham, 1984 | gas phase; between H2O, MeOH; B |
Quantity | Value | Units | Method | Reference | Comment |
ΔrG° | 1586. ± 23. | kJ/mol | IMRB | Bartmess and Burnham, 1984 | gas phase; between H2O, MeOH; B |

Kovats' RI, non-polar column, isothermal

Column type | Active phase | Temperature (C) | I | Reference | Comment |
---|---|---|---|---|---|
Capillary | OV-101 | 0. | 948. | Skrbic and Vojinovic-Miloradov, 1994 | |
Capillary | OV-101 | 100. | 973. | Engewald, Topalova, et al., 1987 | Column length: 50. m; Column diameter: 0.30 mm |
Capillary | Squalane | 106. | 960. | Kugucheva and Mashinsky, 1983 | He; Column length: 100. m |
Capillary | Squalane | 96. | 958. | Kugucheva and Mashinsky, 1983 | He; Column length: 100. m |
Capillary | SE-30 | 70. | 966.4 | Tóth, 1983 | N2; Column length: 15. m; Column diameter: 0.25 mm |
Capillary | SE-30 | 130. | 980. | Bredael, 1982 | Column length: 100. m; Column diameter: 0.5 mm |
Capillary | SE-30 | 80. | 968. | Bredael, 1982 | Column length: 100. m; Column diameter: 0.5 mm |
Packed | Apiezon L | 150. | 1016. | Jaworski, 1982 | Column length: 3. m |
Capillary | Squalane | 86. | 957.8 | Macák, Nabivach, et al., 1982 | N2; Column length: 50. m; Column diameter: 0.25 mm |
Capillary | Squalane | 96. | 960. | Macák, Nabivach, et al., 1982 | N2; Column length: 50. m; Column diameter: 0.25 mm |
Capillary | OV-101 | 100. | 972.5 | Gerasimenko, Kirilenko, et al., 1981 | N2; Column length: 50. m; Column diameter: 0.3 mm |
Capillary | OV-101 | 120. | 977.4 | Gerasimenko, Kirilenko, et al., 1981 | N2; Column length: 50. m; Column diameter: 0.3 mm |
Capillary | OV-101 | 140. | 983.1 | Gerasimenko, Kirilenko, et al., 1981 | N2; Column length: 50. m; Column diameter: 0.3 mm |
Capillary | Squalane | 86. | 957.8 | Nabivach, Bur'yan, et al., 1978 | Column length: 50. m; Column diameter: 0.25 mm |
Capillary | Squalane | 96. | 960.0 | Nabivach, Bur'yan, et al., 1978 | Column length: 50. m; Column diameter: 0.25 mm |
Capillary | SE-30 | 65. | 963.1 | Svob, Deur-Siftar, et al., 1974 | He; Column length: 25.5 m; Column diameter: 0.5 mm |
Capillary | SE-30 | 65. | 963.1 | Svob, Deur-Siftar, et al., 1974 | He; Column length: 25.5 m; Column diameter: 0.5 mm |
Capillary | SE-30 | 65. | 963.2 | Svob, Deur-Siftar, et al., 1974 | He; Column length: 25.5 m; Column diameter: 0.5 mm |
Capillary | SE-30 | 65. | 963.1 | Svob, Deur-Siftar, et al., 1974 | He; Column length: 25.5 m; Column diameter: 0.5 mm |
Capillary | SE-30 | 65. | 963.1 | Svob, Deur-Siftar, et al., 1974 | He; Column length: 25.5 m; Column diameter: 0.5 mm |
Capillary | SE-30 | 65. | 963.5 | Svob and Deur-Siftar, 1974 | He; Column length: 25.5 m; Column diameter: 0.5 mm |

Kovats' RI, polar column, isothermal

Column type | Active phase | Temperature (C) | I | Reference | Comment |
---|---|---|---|---|---|
Capillary | Carbowax 20M | 110. | 1357.2 | Boneva and Vassilev, 1996 | 50. m/0.32 mm/0.3 μm, N2 |
Capillary | Carbowax 20M | 120. | 1366. | Boneva and Vassilev, 1996 | 50. m/0.32 mm/0.3 μm, N2 |
Capillary | PEG-20M | 70. | 1320.9 | Tóth, 1983 | N2; Column length: 30. m; Column diameter: 0.3 mm |
Packed | Carbowax 20M | 150. | 1353.3 | Ellis and Still, 1979 | Chromosorb W, AW-DMCS |
Packed | Carbowax 20M | 115. | 1351.4 | Ellis and Still, 1979 | Chromosorb G |
Packed | Carbowax 20M | 115. | 1352.2 | Ellis and Still, 1979 | Chromosorb G |
Packed | Carbowax 20M | 165. | 1363. | Ellis and Still, 1979, 2 | Chromosorb W, AW-DMCS |
Capillary | Carbowax 20M | 90. | 1300.1 | Döring, Estel, et al., 1974 | Column length: 100. m; Column diameter: 0.2 mm |
Packed | PEG-20M | 120. | 1294.7 | Still, Evans, et al., 1972 | Chromosorb G; Column length: 3. m |
Packed | PEG-20M | 120. | 1295.6 | Still, Evans, et al., 1972 | Chromosorb G; Column length: 3. m |

Van Den Dool and Kratz RI, non-polar column, temperature ramp

Column type | Active phase | I | Reference | Comment |
---|---|---|---|---|
Capillary | CP-Sil 8CB-MS | 986. | Elmore, Cooper, et al., 2005 | 0. m/0.25 mm/0.25 μm, He, 40. C @ 2. min, 4. K/min, 280. C @ 5. min |
Capillary | DB-5 | 987.9 | Xu, van Stee, et al., 2003 | 30. m/0.25 mm/1. μm, He, 2.5 K/min; Tstart: 50. C; Tend: 200. C |
Capillary | DB-1 | 980.0 | Helmig, Klinger, et al., 1999 | 60. m/0.32 mm/1. μm, -50. C @ 2. min, 6. K/min; Tend: 175. C |
Capillary | DB-1 | 964.9 | Helmig, Pollock, et al., 1996 | 30. m/0.25 mm/1. μm, 6. K/min; Tstart: -50. C; Tend: 180. C |
Packed | SE-30 | 985. | Fischer and Kusch, 1990 | Chromosorb W AW (80-100 mesh), 5. K/min; Column length: 1.5 m; Tstart: 60. C; Tend: 280. C |
Capillary | SE-54 | 974.0 | Shapi and Hesso, 1990 | 25. m/0.32 mm/0.15 μm, He, 40. C @ 1. min, 5. K/min, 280. C @ 15. min |
Capillary | SE-54 | 974.0 | Shapi and Hesso, 1990 | 25. m/0.32 mm/0.15 μm, He, 40. C @ 1. min, 5. K/min, 280. C @ 15. min |
Capillary | SE-54 | 974.0 | Shapi and Hesso, 1990 | 25. m/0.32 mm/0.15 μm, He, 40. C @ 1. min, 5. K/min, 280. C @ 15. min |

Van Den Dool and Kratz RI, non-polar column, custom temperature program

Column type | Active phase | I | Reference | Comment |
---|---|---|---|---|
Capillary | DB-1 | 966. | Mattinen, Tuominen, et al., 1995 | 30. m/0.32 mm/1. μm, He; Program: 40C(3min) => 5C/min => 150C => 10C/min => 210C(30min) |

Van Den Dool and Kratz RI, polar column, temperature ramp

Column type | Active phase | I | Reference | Comment |
---|---|---|---|---|
Capillary | CP-Wax 52CB | 1326. | Alasalvar, Taylor, et al., 2005 | 60. m/0.25 mm/0.25 μm, 35. C @ 4. min, 3. K/min; Tend: 203. C |
Capillary | FFAP | 1358. | Ott, Fay, et al., 1997 | 30. m/0.25 mm/0.25 μm, He, 20. C @ 1. min, 4. K/min, 200. C @ 1. min |
Capillary | CP-WAX 57CB | 1305. | Baltes and Mevissen, 1988 | He, 50. C @ 5. min, 2. K/min; Column length: 50. m; Column diameter: 0.24 mm; Tend: 210. C |

Normal alkane RI, non-polar column, temperature ramp

Column type | Active phase | I | Reference | Comment |
---|---|---|---|---|
Capillary | Petrocol DH | 969. | Supelco, 2012 | 100. m/0.25 mm/0.50 μm, Helium, 20. C @ 15. min, 15. K/min, 220. C @ 30. min |
Capillary | OV-101 | 965. | Zenkevich, 2001 | N2, 4. K/min; Column length: 25. m; Column diameter: 0.20 mm; Tstart: 60. C; Tend: 240. C |
Capillary | BP-1 | 972. | Health Safety Executive, 2000 | 50. m/0.22 mm/0.75 μm, He, 5. K/min; Tstart: 50. C; Tend: 200. C |
Capillary | Methyl Silicone | 965.23 | Baraldi, Rapparini, et al., 1999 | 60. m/0.25 mm/0.25 μm, 40. C @ 10. min, 5. K/min; Tend: 220. C |
Capillary | OV-101 | 964. | Orav, Kailas, et al., 1999 | 50. m/0.20 mm/0.50 μm, Helium, 30. C @ 6. min, 1. K/min; Tend: 100. C |
Capillary | SP-2100 | 961. | Fischer and Kusch, 1993 | He, 40. C @ 3. min, 5. K/min; Column length: 30. m; Column diameter: 0.25 mm; Tend: 280. C |
Capillary | OV-101 | 968. | Mandelshtam, Kharicheva, et al., 1991 | Helium, 50. C @ 0. min, 3. K/min, 220. C @ 0. min; Column length: 54. m; Column diameter: 0.26 mm |

Normal alkane RI, non-polar column, custom temperature program

Column type | Active phase | I | Reference | Comment |
---|---|---|---|---|
Capillary | Polydimethyl siloxane with 5 % Ph groups | 987. | Robinson, Adams, et al., 2012 | Program: not specified |
Capillary | Polydimethyl siloxane with 5 % Ph groups | 988. | Robinson, Adams, et al., 2012 | Program: not specified |
Capillary | DB-5 MS | 994. | Cajka, Hajslova, et al., 2007 | 30. m/0.25 mm/0.25 μm, Helium; Program: 45 0C (0.75 min) 10 0C/min -> 200 0C 30 0C/min -> 245 0C (1.25 min) |
Capillary | Polymethylsiloxane, (PMS-20000) | 966. | Cornwell and Cordano, 2003 | Program: not specified |
Capillary | DB-1 | 967. | Hathcock and Bertsch, 1993 | 100. m/0.25 mm/0.5 μm; Program: not specified |
Capillary | OV-1, SE-30, Methyl silicone, SP-2100, OV-101, DB-1, etc. | 963. | Waggott and Davies, 1984 | Hydrogen; Column length: 50. m; Column diameter: 0.32 mm; Program: not specified |
Capillary | OV-1, SE-30, Methyl silicone, SP-2100, OV-101, DB-1, etc. | 968. | Waggott and Davies, 1984 | Hydrogen; Column length: 50. m; Column diameter: 0.32 mm; Program: not specified |

Normal alkane RI, polar column, isothermal

Column type | Active phase | Temperature (C) | I | Reference | Comment |
---|---|---|---|---|---|
Capillary | Carbowax 20M | 90. | 1300. | Sutter, Peterson, et al., 1997 |

Normal alkane RI, polar column, temperature ramp

Column type | Active phase | I | Reference | Comment |
---|---|---|---|---|
Capillary | DB-Wax | 1325. | Umano, Nakahara, et al., 1999 | 60. m/0.25 mm/0.25 μm, He, 40. C @ 2. min, 2. K/min; Tend: 200. C |

Normal alkane RI, polar column, custom temperature program

Column type | Active phase | I | Reference | Comment |
---|---|---|---|---|
Capillary | Carbowax 20M | 1321. | Cornwell and Cordano, 2003 | Program: not specified |

Lee's RI, non-polar column, custom temperature program

Column type | Active phase | I | Reference | Comment |
---|---|---|---|---|
Capillary | DB-5 | 151.1 | Fuentes, Font, et al., 2007 | Column length: 60. m; Program: not specified |
Capillary | DB-5MS | 155.1 | Aracil, Font, et al., 2005 | Column length: 60. m; Column diameter: 0.25 mm; Program: not specified |
Capillary | HP-5MS | 155.89 | Cheng, Liu, et al., 2005 | 30. m/0.30 mm/0.25 μm, He; Program: 50 0C (2 min) 8 0C/min -> 120 0C (3 min) 10 0C/min -> 230 0C |

References

Guthrie, 1978
Guthrie, J.P.,
Equilibrium constants for a series of simple aldol condensations, and linear free energy relations with other carbonyl addition reactions,
Can. J. Chem., 1978, 56, 962-973. [all data]
Krall and Roberts, 1958
Krall, R.E.; Roberts, J.D.,
Strain variation in the unsaturated cyclobutane ring,
Am. Chem. Soc. Div. Pet. Chem., 1958, 3, 63-68. [all data]
Thermodynamics Research Center, 1997
Thermodynamics Research Center,
Selected Values of Properties of Chemical Compounds., Thermodynamics Research Center, Texas A&M University, College Station, Texas, 1997. [all data]
Roberts and Jessup, 1951
Roberts, D.E.; Jessup, R.S.,
Heat of polymerization of alpha-methylstyrene from heats of combustion of monomer and four polymer fractions,
J. Res. NBS, 1951, 46, 11-17. [all data]
Lemoult, 1911
Lemoult, M.P.,
Thermochimie. - Recherches sur les derives du styrolene; rectification de quelques erreurs experimentales,
Compt. Rend., 1911, 152, 1402-1404. [all data]
Auwsers, Roth, et al., 1910
Auwsers, K.; Roth, W.A.; Eisenlohr, F.,
III. Verbrennungswarmen von Terpenen und Styrolen,
Justus Liebigs Ann. Chem., 1910, 267-290. [all data]
Lebedev and Rabinovich, 1971
Lebedev, B.V.; Rabinovich, I.B.,
Heat capacities and thermodynamic functions of a-methylstyrene and poly(a-methylstyrene),
Tr. Khim. Khim. Tekhnol., 1971, 1, 12-15. [all data]
Anonymous, 1952
Anonymous, R.,
, Physical Properties of Chemical Substances, Dow Chemical Co., 1952. [all data]
Anonymous, 1946
Anonymous, R.,
, Am. Pet. Inst. Res. Proj. 45, Ohio State Univ., 1946. [all data]
Stull, 1945
Stull, D.R.,
Personal Commun., Dow Chemical Co., 1945. [all data]
Anonymous, 1943
Anonymous, R.,
, Sunbury Rep. No. 2176, Anglo-Iranian Oil Co., 1943. [all data]
Steele, Chirico, et al., 1997
Steele, W.V.; Chirico, R.D.; Knipmeyer, S.E.; Nguyen, A.,
Vapor Pressure, Heat Capacity, and Density along the Saturated Line, Measurements for Dimethyl Isophthalate, Dimethyl Carbonate, 1,3,5-Trimethyl benzene, Pentafluorophenol, 4-tert-Butylcatechol, .alp,
J. Chem. Eng. Data, 1997, 42, 1008-20. [all data]
Verevkin, 1999
Verevkin, Sergey P.,
Thermochemical investigation on α-methyl-styrene and parent phenyl substituted alkenes,
Thermochimica Acta, 1999, 326, 1-2, 17-25, https://doi.org/10.1016/S0040-6031(98)00585-1
. [all data]
Steele, Chirico, et al., 1997, 2
Steele, W.V.; Chirico, R.D.; Knipmeyer, S.E.; Nguyen, A.,
Vapor Pressure, Heat Capacity, and Density along the Saturation Line, Measurements for Dimethyl Isophthalate, Dimethyl Carbonate, 1,3,5-Triethylbenzene, Pentafluorophenol, 4- tert -Butylcatechol, α-Methylstyrene, and N , N '-Bis(2-hydroxyethyl)ethylenediamine,
J. Chem. Eng. Data, 1997, 42, 6, 1008-1020, https://doi.org/10.1021/je970102d
. [all data]
Stephenson and Malanowski, 1987
Stephenson, Richard M.; Malanowski, Stanislaw,
Handbook of the Thermodynamics of Organic Compounds, 1987, https://doi.org/10.1007/978-94-009-3173-2
. [all data]
Stull, 1947
Stull, Daniel R.,
Vapor Pressure of Pure Substances. Organic and Inorganic Compounds,
Ind. Eng. Chem., 1947, 39, 4, 517-540, https://doi.org/10.1021/ie50448a022
. [all data]
Domalski and Hearing, 1996
Domalski, Eugene S.; Hearing, Elizabeth D.,
Heat Capacities and Entropies of Organic Compounds in the Condensed Phase. Volume III,
J. Phys. Chem. Ref. Data, 1996, 25, 1, 1, https://doi.org/10.1063/1.555985
. [all data]
Arnett and Pienta, 1980
Arnett, E.M.; Pienta, N.J.,
Stabilities of carbonium ions in solution. 12. Heats of formation of alkyl chlorides as an entree to heats of solvation of aliphatic carbonium ions,
J. Am. Chem. Soc., 1980, 102, 3329-3334. [all data]
Nesterova, Kovzel, et al., 1977
Nesterova, T.N.; Kovzel, E.N.; Karaseva, S.Ya.; Rozhnov, A.M.,
Heats of reaction of the hydrohalogenation of styrene and α-methylstyrene,
Vses. Konf. Kalorim. Rasshir. Tezisy Dokl. 7th, 1977, 1, 132. [all data]
Bartmess and Burnham, 1984
Bartmess, J.E.; Burnham, R.,
Effect of central substituents on the gas phase acidities of propenes,
J. Org. Chem., 1984, 49, 1382. [all data]
Abboud, Jimenez, et al., 1995
Abboud, J.-L.M.; Jimenez, P.; Roux, M.V.; Turrion, C.; Lopez-Mardomingo, C.; Podosenin, A.; Rogers, D.W.; Liebman, J.F.,
Interrelations of the energetics of amides and alkenes: enthalpies of formation of N,N-dimethyl dertivatives of pivalamide, 1-adamantylcarboxamide and benzamide, and of styrene and its a-, trans-β- and β,β-methylated derivates,
J. Phys. Org. Chem., 1995, 8, 15-25. [all data]
Hunter and Lias, 1998
Hunter, E.P.; Lias, S.G.,
Evaluated Gas Phase Basicities and Proton Affinities of Molecules: An Update,
J. Phys. Chem. Ref. Data, 1998, 27, 3, 413-656, https://doi.org/10.1063/1.556018
. [all data]
Koppel, Schwarz, et al., 1974
Koppel, C.; Schwarz, H.; Bohlmann, F.,
Elektronenstossinduzierte fragmentierung von acetylenverbindungen. VIII. Struktur der stabilen und instabilen ionen[C9H9]+ aus isomeren C9H10- kohlenwasserstoffen,
Org. Mass Spectrom., 1974, 8, 25. [all data]
Benito, Seidl, et al., 1973
Benito, I.; Seidl, H.; Bock, H.,
Efectos electronicos y estericos de sustituyentes alquilicos y silicicos sobre el sistema electronico π del estireno,
Rev. Fac. Cienc. Univ. Oviedo, 1973, 14, 95. [all data]
Watanabe, Nakayama, et al., 1962
Watanabe, K.; Nakayama, T.; Mottl, J.,
Ionization potentials of some molecules,
J. Quant. Spectry. Radiative Transfer, 1962, 2, 369. [all data]
Chizhov, Timoshenko, et al., 1986
Chizhov, Y.V.; Timoshenko, M.M.; Kleimenov, V.I.; Borisov, Y.A.; Zol'nikova, G.P.; Kravtsov, D.N.; Kritskaya, I.I.,
Investigation of the mechanism of fragment coordination of aromatic molecules with transition metals by photoelectron spectroscopy - tricarbonyliron complexes,
J. Struct. Chem., 1986, 27, 401. [all data]
Kobayashi, Yokota, et al., 1973
Kobayashi, T.; Yokota, K.; Nagakura, S.,
Photoelectron spectra of styrenes,
J. Electron Spectrosc. Relat. Phenom., 1973, 3, 449. [all data]
Beaven and Johnson, 1957
Beaven, G.H.; Johnson, E.A.,
The relation between configuration and conjugation in diphenyl derivatives. Part VIII. Some compounds derived from 2:2'-di-acetyldiphenyl,
J. Chem. Soc., 1957, 651-658. [all data]
Skrbic and Vojinovic-Miloradov, 1994
Skrbic, B.D.; Vojinovic-Miloradov, M.B.,
A contribution to the qualitative GC analysis of some non-chlorinated xenobiotic chemicals in waste waters,
Water Sci. Technol., 1994, 30, 3, 91-93. [all data]
Engewald, Topalova, et al., 1987
Engewald, W.; Topalova, I.; Petsev, N.; Dimitrov, Chr.,
Structure-Retention Correlations of Hydrocarbons in GLC and GSC. Alkenylbenzenes,
Chromatographia, 1987, 23, 8, 561-565, https://doi.org/10.1007/BF02324864
. [all data]
Kugucheva and Mashinsky, 1983
Kugucheva, E.E.; Mashinsky, V.I.,
Retention Indices of Aromatic Hydrocarbons on Capillary Columns with Squalan and Polyphenyl Ether,
Zh. Anal. Khim. (Rus), 1983, 38, 11, 2023-2026. [all data]
Tóth, 1983
Tóth, T.,
Use of capillary gas chromatography in collecting retention and chemical information for the analysis of complex petrochemical mixtures,
J. Chromatogr., 1983, 279, 157-165, https://doi.org/10.1016/S0021-9673(01)93614-3
. [all data]
Bredael, 1982
Bredael, P.,
Retention indices of hydrocarbons on SE-30,
J. Hi. Res. Chromatogr. Chromatogr. Comm., 1982, 5, 6, 325-328, https://doi.org/10.1002/jhrc.1240050610
. [all data]
Jaworski, 1982
Jaworski, M.,
Wybrane przyklady stosowania systemu indeksów retencji,
Przem. Chem., 1982, 61, 9, 334-338. [all data]
Macák, Nabivach, et al., 1982
Macák, J.; Nabivach, V.; Buryan, P.; Sindler, S.,
Dependence of retention indices of alkylbenzenes on their molecular structure,
J. Chromatogr., 1982, 234, 2, 285-302, https://doi.org/10.1016/S0021-9673(00)81867-1
. [all data]
Gerasimenko, Kirilenko, et al., 1981
Gerasimenko, V.A.; Kirilenko, A.V.; Nabivach, V.M.,
Capillary gas chromatography of aromatic compounds found in coal tar fractions,
J. Chromatogr., 1981, 208, 1, 9-16, https://doi.org/10.1016/S0021-9673(00)87953-4
. [all data]
Nabivach, Bur'yan, et al., 1978
Nabivach, V.M.; Bur'yan, P.; Matsak, I.,
Retention indices of aromatic hydrocarbons on a squalane capillary column,
Zh. Anal. Khim., 1978, 33, 7, 1108-1113. [all data]
Svob, Deur-Siftar, et al., 1974
Svob, V.; Deur-Siftar, D.; Cramers, C.A.,
Mechanisms of the thermal degradation of alkylbenzenes,
J. Chromatogr., 1974, 91, 659-675, https://doi.org/10.1016/S0021-9673(01)97946-4
. [all data]
Svob and Deur-Siftar, 1974
Svob, V.; Deur-Siftar, D.,
Kovats Retention Indices in the Identification of Alkylbenzene Degradation Products,
J. Chromatogr., 1974, 91, 677-689, https://doi.org/10.1016/S0021-9673(01)97947-6
. [all data]
Boneva and Vassilev, 1996
Boneva, S.; Vassilev, K.,
Gas chromatographic separation of epoxystyrenes on carbowax 20 M capillary column,
Chromatographia, 1996, 43, 3/4, 208-210, https://doi.org/10.1007/BF02292953
. [all data]
Ellis and Still, 1979
Ellis, T.S.; Still, R.H.,
Thermal degradation of polymers. XXI. Vacuum pyrolysis of poly(m-N,N-dimethylaminostyrene); the products volatile at pyrolysis temperature, liquid at room temperature,
J. Appl. Polym. Sci., 1979, 23, 10, 2837-2854, https://doi.org/10.1002/app.1979.070231002
. [all data]
Ellis and Still, 1979, 2
Ellis, T.S.; Still, R.H.,
Thermal degradation of polymers. XXIII. Vacuum pyrolysis of poly(p-N,N-dimethylaminostyrene); the products volatile at pyrolysis temperature, liquid or gaseous at room temperature,
J. Appl. Polym. Sci., 1979, 23, 10, 2871-2880, https://doi.org/10.1002/app.1979.070231004
. [all data]
Döring, Estel, et al., 1974
Döring, C.E.; Estel, D.; Fischer, R.,
Kapillar-gaschromatographische Charakterisierung von C10-bis C12-Aromaten,
J. Prakt. Chem., 1974, 316, 1, 1-12, https://doi.org/10.1002/prac.19743160102
. [all data]
Still, Evans, et al., 1972
Still, R.H.; Evans, M.B.; Whitehead, A.,
Thermal Degradation of Polymers. V. Vacuum Pyrolysis of Poly (p-N,N-dimethylaminostyrene) . The Products Volatile at Pyrolysis Temperature, Liquid or Gaseous at Room Temperature,
J. Appl. Polym. Sci., 1972, 16, 12, 3207-3221, https://doi.org/10.1002/app.1972.070161213
. [all data]
Elmore, Cooper, et al., 2005
Elmore, J.S.; Cooper, S.L.; Enser, M.; Mottram, D.S.; Sinclair, L.A.; Wilkinson, R.G.; Wood, J.D.,
Dietary manipulation of fatty acid composition in lamb meat and its effect on the volatile aroma compounds of grilled lamb,
Meat Sci., 2005, 69, 2, 233-242, https://doi.org/10.1016/j.meatsci.2004.07.002
. [all data]
Xu, van Stee, et al., 2003
Xu, X.; van Stee, L.L.P.; Williams, J.; Beens, J.; Adahchour, M.; Vreuls, R.J.J.; Brinkman, U.A.Th.; Lelieveld, J.,
Comprehensive two-dimensional gas chromatography (GC×GC) measurements of volatile organic compounds in the atmosphere,
Atmos. Chem. Phys., 2003, 3, 3, 665-682, https://doi.org/10.5194/acp-3-665-2003
. [all data]
Helmig, Klinger, et al., 1999
Helmig, D.; Klinger, L.F.; Guenther, A.; Vierling, L.; Geron, C.; Zimmerman, P.,
Biogenic volatile organic compound emissions (BVOCs). I. Identifications from three continental sites in the U.S.,
Chemosphere, 1999, 38, 9, 2163-2187, https://doi.org/10.1016/S0045-6535(98)00425-1
. [all data]
Helmig, Pollock, et al., 1996
Helmig, D.; Pollock, W.; Greenberg, J.; Zimmerman, P.,
Gas chromatography mass spectrometry analysis of volatile organic trace gases at Mauna Loa Observatory, Hawaii,
J. Geophys. Res., 1996, 101, D9, 14697-14710, https://doi.org/10.1029/96JD00212
. [all data]
Fischer and Kusch, 1990
Fischer, W.G.; Kusch, P.,
Automatic sampler for Curie-point pyrolysis-gas chromatography with on-column introduction of pyrolysates,
J. Chromatogr., 1990, 518, 9-19, https://doi.org/10.1016/S0021-9673(01)93158-9
. [all data]
Shapi and Hesso, 1990
Shapi, M.M.; Hesso, A.,
Thermal decomposition of polystyrene volatile compounds from large-scale pyrolysis,
J. Anal. Appl. Pyrolysis, 1990, 18, 2, 143-161, https://doi.org/10.1016/0165-2370(90)80004-8
. [all data]
Mattinen, Tuominen, et al., 1995
Mattinen, M.-L.; Tuominen, J.; Saarela, K.,
Analysis of TVOC and certain selected compounds from indoor air using GC/FID-RIM technique,
Indoor Air, 1995, 5, 1, 56-61, https://doi.org/10.1111/j.1600-0668.1995.t01-1-00009.x
. [all data]
Alasalvar, Taylor, et al., 2005
Alasalvar, C.; Taylor, K.D.A.; Shahidi, F.,
Comparison of volatiles of cultured and wild sea bream (Sparus aurata) during storage in ice by dynamic headspace analysis/gas chromatography-mass spectrometry,
J. Agric. Food Chem., 2005, 53, 7, 2616-2622, https://doi.org/10.1021/jf0483826
. [all data]
Ott, Fay, et al., 1997
Ott, A.; Fay, L.B.; Chaintreau, A.,
Determination and origin of the aroma impact compounds of yogurt flavor,
J. Agric. Food Chem., 1997, 45, 3, 850-858, https://doi.org/10.1021/jf960508e
. [all data]
Baltes and Mevissen, 1988
Baltes, W.; Mevissen, L.,
Model reactions on roast aroma formation. VI. Volatile reaction products from the reaction of phenylalanine with glucose during cooking and roasting,
Z. Lebensm. Unters. Forsch., 1988, 187, 3, 209-214, https://doi.org/10.1007/BF01043341
. [all data]
Supelco, 2012
Supelco, CatalogNo. 24160-U,
Petrocol DH Columns. Catalog No. 24160-U, 2012, retrieved from http://www.sigmaaldrich.com/etc/medialib/docs/Supelco/Datasheet/1/w97949.Par.0001.File.tmp/w97949.pdf. [all data]
Zenkevich, 2001
Zenkevich, I.G.,
Interpretation of Gas Chromatographic Retention Indices in estimation of Structures of Isomeric Products of Radical Chlorinating of Alkyl Arenes,
Zh. Org. Khim., 2001, 37, 2, 283-293. [all data]
Health Safety Executive, 2000
Health Safety Executive,
MDHS 96 Volatile organic compounds in air - Laboratory method using pumed solid sorbent tubes, solvent desorption and gas chromatography
in Methods for the Determination of Hazardous Substances (MDHS) guidance, Crown, Colegate, Norwich, 2000, 1-24, retrieved from http://www.hse.gov.uk/pubns/mdhs/pdfs/mdhs96.pdf. [all data]
Baraldi, Rapparini, et al., 1999
Baraldi, R.; Rapparini, F.; Rossi, F.; Latella, A.; Ciccioli, P.,
Volatile organic compound emissions from flowers of the most occurring and economically important species of fruit trees,
Phys. Chem. Earth, 1999, 24, 6, 729-732, https://doi.org/10.1016/S1464-1909(99)00073-8
. [all data]
Orav, Kailas, et al., 1999
Orav, A.; Kailas, T.; Muurisepp, M.; Kann, J.,
Composition of the oil from waste tires. 1. Fraction boiling at yp to 160 0C,
Proc. Estonian Acad. Sci. Chem., 1999, 48, 1, 30-39. [all data]
Fischer and Kusch, 1993
Fischer, G.W.; Kusch, P.,
An Automated Curie-Point Pyrolysis-High Resolution Gas Chromatography System,
LC-GC Int., 1993, 6, 12, 760-763. [all data]
Mandelshtam, Kharicheva, et al., 1991
Mandelshtam, T.V.; Kharicheva, E.M.; Gorobets, I.A.; Zenkevich, I.G.; Kostikov, R.R.; Porokhovnikova, E.B.,
Synthesis and Chromato Mass Spectrometric Investigation of alpha-Alkoxystyrenes,
Zh. Org. Khim. (Rus.), 1991, 27, 4, 684-690. [all data]
Robinson, Adams, et al., 2012
Robinson, A.L.; Adams, D.O.; Boss, P.K.; Heymann, H.; Solomon, P.S.; Trengove, R.D.,
Influence of geographic origine on the sensory characteristics and wine composition of Vitus viniferas cv. Cabernet Sauvignon wines from Australia (Supplemental data),
Am. J. Enol. Vitic., 2012, 64, 4, 467-476, https://doi.org/10.5344/ajev.2012.12023
. [all data]
Cajka, Hajslova, et al., 2007
Cajka, T.; Hajslova, J.; Cochran, J.; Holadova, K.; Klimankova, E.,
Solid phase microextraction - comprehensive two dimensional gas chromatography - time-of-flight mass spectrometry for the analysis of honey volatiles,
J. Sep. Sci., 2007, 30, 4, 534-546, https://doi.org/10.1002/jssc.200600413
. [all data]
Cornwell and Cordano, 2003
Cornwell, E.; Cordano, G.,
Nueva proposicion para predecir datos de retencion obtenidos mediante cromatografia de gases de hidrocarburos derivados de las naftas,
Revista de la Sociedad Quimica de Mexico, 2003, 47, 1, 38-43. [all data]
Hathcock and Bertsch, 1993
Hathcock, S.; Bertsch, W.,
Analysis of volatiles associated with industrial scale processing of expanded polystyrene. Part II: Identification and quantitation,
J. Hi. Res. Chromatogr., 1993, 16, 11, 651-659, https://doi.org/10.1002/jhrc.1240161106
. [all data]
Waggott and Davies, 1984
Waggott, A.; Davies, I.W.,
Identification of organic pollutants using linear temperature programmed retention indices (LTPRIs) - Part II, 1984, retrieved from http://dwi.defra.gov.uk/research/completed-research/reports/dwi0383.pdf. [all data]
Sutter, Peterson, et al., 1997
Sutter, J.M.; Peterson, T.A.; Jurs, P.C.,
Prediction of gas chromatographic retention indices of alkylbenzenes,
Anal. Chim. Acta., 1997, 342, 2-3, 113-122, https://doi.org/10.1016/S0003-2670(96)00578-8
. [all data]
Umano, Nakahara, et al., 1999
Umano, K.; Nakahara, K.; Shoji, A.; Shibamoto, T.,
Aroma chemicals isolated and identified from leaves of aloe arborescens Mill. Var. natalensis Berger,
J. Agric. Food Chem., 1999, 47, 9, 3702-3705, https://doi.org/10.1021/jf990116i
. [all data]
Fuentes, Font, et al., 2007
Fuentes, M.J.; Font, R.; Gomez-Rico, M.F.; Martin-Gullon, I.,
Pyrolysis and combustion of waste lubricant oil from diesel cars: Decomposition and pollutants,
J. Anal. Appl. Pyrolysis, 2007, 79, 1-2, 215-226, https://doi.org/10.1016/j.jaap.2006.12.004
. [all data]
Aracil, Font, et al., 2005
Aracil, I.; Font, R.; Conesa, J.A.,
Semivolatile and volatile compounds from the pyrolysis and combustion of polyvinyl chloride,
J. Anal. Appl. Pyrolysis, 2005, 74, 1-2, 465-478, https://doi.org/10.1016/j.jaap.2004.09.008
. [all data]
Cheng, Liu, et al., 2005
Cheng, D.-X.; Liu, B.-X.; Sun, Y.-A.; Xie, B.; Zhang, H.-L.,
rapid analysis of pyrolysis products of cholesterol by GC-MS assited with boiling point - Lee retention index,
journal of Instrumental Analysis - Fenxi ceshi xuebao, 2005, 24, 6, 85-88. [all data]