Benzene, (1-methylethyl)-
- Formula: C9H12
- Molecular weight: 120.1916
- IUPAC Standard InChIKey: RWGFKTVRMDUZSP-UHFFFAOYSA-N
- CAS Registry Number: 98-82-8
- Chemical structure:
View 3d structure (requires JavaScript / HTML 5) - Other names: Cumene; Cumol; Isopropylbenzene; 2-Phenylpropane; (1-Methylethyl)benzene; Isopropylbenzol; Benzene, isopropyl-; Cumeen; Isopropilbenzene; Isopropylbenzeen; Propane, 2-phenyl-; 2-Fenilpropano; 2-Fenyl-propaan; Rcra waste number U055; UN 1918; (Methylethyl)benzene; Benzene, i-propyl-; i-Propylbenzene; NSC 8776; iso-propylbenzene (cumene); (1-methylethyl)benzene (cumene)

Gas phase thermochemistry data

Data compiled as indicated in comments:
ALS - Hussein Y. Afeefy, Joel F. Liebman, and Stephen E. Stein
GT - Glushko Thermocenter, Russian Academy of Sciences, Moscow
Quantity | Value | Units | Method | Reference | Comment |
---|---|---|---|---|---|
ΔfH°gas | 3.9 ± 1.1 | kJ/mol | Ccb | Prosen, Gilmont, et al., 1945 | Hf by Prosen, Johnson, et al., 1946; ALS |
Quantity | Value | Units | Method | Reference | Comment |
S°gas | 386.53 | J/mol*K | N/A | Kishimoto K., 1973 | GT |

Condensed phase thermochemistry data

Data compiled as indicated in comments:
ALS - Hussein Y. Afeefy, Joel F. Liebman, and Stephen E. Stein
DH - Eugene S. Domalski and Elizabeth D. Hearing
Quantity | Value | Units | Method | Reference | Comment |
---|---|---|---|---|---|
ΔfH°liquid | -41.2 ± 1.1 | kJ/mol | Ccb | Prosen, Gilmont, et al., 1945 | Hf by Prosen, Johnson, et al., 1946; ALS |
Quantity | Value | Units | Method | Reference | Comment |
ΔcH°liquid | -5215.44 ± 0.96 | kJ/mol | Ccb | Prosen, Gilmont, et al., 1945 | Hf by Prosen, Johnson, et al., 1946; Corresponding ΔfHºliquid = -41.1 kJ/mol (simple calculation by NIST; no Washburn corrections); ALS |
ΔcH°liquid | -5218.6 | kJ/mol | Ccb | Richards and Barry, 1915 | At 291 K; Corresponding ΔfHºliquid = -38.0 kJ/mol (simple calculation by NIST; no Washburn corrections); ALS |
Quantity | Value | Units | Method | Reference | Comment |
S°liquid | 277.57 | J/mol*K | N/A | Kishimoto, Suga, et al., 1973 | DH |
Constant pressure heat capacity of liquid
Cp,liquid (J/mol*K) | Temperature (K) | Reference | Comment |
---|---|---|---|
214.4 | 295.96 | Andolenko and Grigor'ev, 1979 | T = 296 to 413 K. Unsmoothed experimental datum given as 1.784 kJ/kg*K.; DH |
215.40 | 298.15 | Kishimoto, Suga, et al., 1973 | T = 14 to 314 K. Glass, 14 to 126 K.; DH |
209.41 | 299.8 | Schlinger and Sage, 1952 | T = 300 to 366 K.; DH |
213.0 | 298. | Kurbatov, 1947 | T = 16 to 153°C, mean Cp, four temperatures.; DH |
198.7 | 302.0 | de Kolossowsky and Udowenko, 1934 | DH |
198.7 | 302.0 | Kolosovskii and Udovenko, 1934 | DH |

Phase change data

Data compiled as indicated in comments:
TRC - Thermodynamics Research Center, NIST Boulder Laboratories, Chris Muzny director
BS - Robert L. Brown and Stephen E. Stein
AC - William E. Acree, Jr., James S. Chickos
ALS - Hussein Y. Afeefy, Joel F. Liebman, and Stephen E. Stein
DRB - Donald R. Burgess, Jr.
DH - Eugene S. Domalski and Elizabeth D. Hearing
CAL - James S. Chickos, William E. Acree, Jr., Joel F. Liebman, Students of Chem 202 (Introduction to the Literature of Chemistry), University of Missouri -- St. Louis
Quantity | Value | Units | Method | Reference | Comment |
---|---|---|---|---|---|
Tboil | 425. ± 1. | K | AVG | N/A | Average of 58 out of 64 values; Individual data points |
Quantity | Value | Units | Method | Reference | Comment |
Tfus | 177.0 ± 0.7 | K | AVG | N/A | Average of 13 values; Individual data points |
Quantity | Value | Units | Method | Reference | Comment |
Ttriple | 177.13 | K | N/A | Kishimoto, Suga, et al., 1973, 2 | Uncertainty assigned by TRC = 0.01 K; TRC |
Quantity | Value | Units | Method | Reference | Comment |
Tc | 631.0 ± 0.5 | K | N/A | Tsonopoulos and Ambrose, 1995 | |
Tc | 631.1 | K | N/A | Ambrose and Grant, 1957 | Uncertainty assigned by TRC = 0.15 K; TRC |
Tc | 624.55 | K | N/A | Glaser and Ruland, 1957 | Uncertainty assigned by TRC = 2. K; TRC |
Tc | 635.9 | K | N/A | Altschul, 1893 | Uncertainty assigned by TRC = 4. K; TRC |
Quantity | Value | Units | Method | Reference | Comment |
Pc | 32.1 ± 0.4 | bar | N/A | Tsonopoulos and Ambrose, 1995 | |
Pc | 32.09 | bar | N/A | Ambrose, Broderick, et al., 1967 | Uncertainty assigned by TRC = 0.06 bar; TRC |
Pc | 27.8644 | bar | N/A | Glaser and Ruland, 1957 | Uncertainty assigned by TRC = 1.5199 bar; TRC |
Pc | 31.60 | bar | N/A | Altschul, 1893 | Uncertainty assigned by TRC = 0.0588 bar; TRC |
Quantity | Value | Units | Method | Reference | Comment |
ρc | 2.32 | mol/l | N/A | Hales and Townsend, 1972 | Uncertainty assigned by TRC = 0.008 mol/l; from fit of obs data to 490 K to Rideal's equation; TRC |
Quantity | Value | Units | Method | Reference | Comment |
ΔvapH° | 44. ± 5. | kJ/mol | AVG | N/A | Average of 9 values; Individual data points |
Enthalpy of vaporization
ΔvapH (kJ/mol) | Temperature (K) | Method | Reference | Comment |
---|---|---|---|---|
41.2 | 364. | N/A | Cepeda, Gonzalez, et al., 1989 | Based on data from 349. to 426. K.; AC |
42.1 | 354. | A | Stephenson and Malanowski, 1987 | Based on data from 339. to 433. K.; AC |
41.9 | 358. | MM | Forziati, Norris, et al., 1949 | Based on data from 343. to 426. K. See also Willingham, Taylor, et al., 1945.; AC |
Antoine Equation Parameters
log10(P) = A − (B / (T + C))
P = vapor pressure (bar)
T = temperature (K)
View plot Requires a JavaScript / HTML 5 canvas capable browser.
Temperature (K) | A | B | C | Reference |
---|---|---|---|---|
343.17 to 426.52 | 4.05419 | 1455.811 | -65.948 | Williamham, Taylor, et al., 1945 |
Enthalpy of fusion
ΔfusH (kJ/mol) | Temperature (K) | Reference | Comment |
---|---|---|---|
7.326 | 177.13 | Kishimoto, Suga, et al., 1973 | DH |
7.32 | 177.1 | Kishimoto, Suga, et al., 1973 | AC |
Entropy of fusion
ΔfusS (J/mol*K) | Temperature (K) | Reference | Comment |
---|---|---|---|
41.36 | 177.13 | Kishimoto, Suga, et al., 1973 | DH |
41.37 | 177.1 | Kishimoto, Suga, et al., 1973, 2 | CAL |

Reaction thermochemistry data

Data compiled as indicated in comments:
B - John E. Bartmess
M - Michael M. Meot-Ner (Mautner) and Sharon G. Lias
ALS - Hussein Y. Afeefy, Joel F. Liebman, and Stephen E. Stein
Individual Reactions
C9H11- + =
By formula: C9H11- + H+ = C9H12
Quantity | Value | Units | Method | Reference | Comment |
---|---|---|---|---|---|
ΔrH° | 1585. ± 8.8 | kJ/mol | G+TS | Bartmess, Scott, et al., 1979 | gas phase; value altered from reference due to change in acidity scale; B |
Quantity | Value | Units | Method | Reference | Comment |
ΔrG° | 1560. ± 8.4 | kJ/mol | IMRE | Bartmess, Scott, et al., 1979 | gas phase; value altered from reference due to change in acidity scale; B |
By formula: NO- + C9H12 = (NO- • C9H12)
Quantity | Value | Units | Method | Reference | Comment |
---|---|---|---|---|---|
ΔrH° | 189. | kJ/mol | ICR | Reents and Freiser, 1981 | gas phase; switching reaction,Thermochemical ladder(NO+)C2H5OH, Entropy change calculated or estimated; Farid and McMahon, 1978; M |
By formula: Cl- + C9H12 = (Cl- • C9H12)
Quantity | Value | Units | Method | Reference | Comment |
---|---|---|---|---|---|
ΔrG° | 23.0 | kJ/mol | TDEq | French, Ikuta, et al., 1982 | gas phase; B |
Free energy of reaction
ΔrG° (kJ/mol) | T (K) | Method | Reference | Comment |
---|---|---|---|---|
21. | 300. | PHPMS | French, Ikuta, et al., 1982 | gas phase; M |
By formula: H2 + C9H10 = C9H12
Quantity | Value | Units | Method | Reference | Comment |
---|---|---|---|---|---|
ΔrH° | -111.3 ± 2.1 | kJ/mol | Chyd | Abboud, Jimenez, et al., 1995 | liquid phase; solvent: Hyrocarbon; Like gas phase; ALS |
By formula: C9H11Cl + C6H6 = C6H5Cl + C9H12
Quantity | Value | Units | Method | Reference | Comment |
---|---|---|---|---|---|
ΔrH° | -0.59 ± 0.42 | kJ/mol | Eqk | Nesterova, Rozhnov, et al., 1985 | liquid phase; ALS |
By formula: C10H14 + C6H6 = C7H8 + C9H12
Quantity | Value | Units | Method | Reference | Comment |
---|---|---|---|---|---|
ΔrH° | 0.0 ± 0.6 | kJ/mol | Eqk | Tsvetkov, Rozhnov, et al., 1985 | liquid phase; ALS |
By formula: 2C9H12 = C12H18 + C6H6
Quantity | Value | Units | Method | Reference | Comment |
---|---|---|---|---|---|
ΔrH° | 1.5 ± 0.63 | kJ/mol | Eqk | Popov, Rozhnov, et al., 1974 | gas phase; ALS |
By formula: 2C9H12 = C6H6 + C12H18
Quantity | Value | Units | Method | Reference | Comment |
---|---|---|---|---|---|
ΔrH° | 1.5 ± 0.59 | kJ/mol | Eqk | Popov, Rozhnov, et al., 1974 | gas phase; ALS |
By formula: 3H2 + C9H12 = C9H18
Quantity | Value | Units | Method | Reference | Comment |
---|---|---|---|---|---|
ΔrH° | -208. | kJ/mol | Eqk | Miki, 1975 | gas phase; GC; ALS |

Henry's Law data

Data compiled by: Rolf Sander
Henry's Law constant (water solution)
kH(T) = k°H exp(d(ln(kH))/d(1/T) ((1/T) - 1/(298.15 K)))
k°H = Henry's law constant for solubility in water at 298.15 K (mol/(kg*bar))
d(ln(kH))/d(1/T) = Temperature dependence constant (K)
k°H (mol/(kg*bar)) | d(ln(kH))/d(1/T) (K) | Method | Reference | Comment |
---|---|---|---|---|
0.087 | 3200. | X | N/A | |
0.068 | Q | N/A | Several references are given in the list of Henry's law constants but not assigned to specific species. | |
0.068 | Q | N/A | missing citation give several references for the Henry's law constants but don't assign them to specific species. | |
0.78 | L | N/A | ||
0.068 | V | N/A |

Gas phase ion energetics data

Data evaluated as indicated in comments:
HL - Edward P. Hunter and Sharon G. Lias
L - Sharon G. Lias
Data compiled as indicated in comments:
B - John E. Bartmess
LBLHLM - Sharon G. Lias, John E. Bartmess, Joel F. Liebman, John L. Holmes, Rhoda D. Levin, and W. Gary Mallard
LLK - Sharon G. Lias, Rhoda D. Levin, and Sherif A. Kafafi
RDSH - Henry M. Rosenstock, Keith Draxl, Bruce W. Steiner, and John T. Herron
Quantity | Value | Units | Method | Reference | Comment |
---|---|---|---|---|---|
IE (evaluated) | 8.73 ± 0.02 | eV | N/A | N/A | L |
Quantity | Value | Units | Method | Reference | Comment |
Proton affinity (review) | 791.6 | kJ/mol | N/A | Hunter and Lias, 1998 | HL |
Quantity | Value | Units | Method | Reference | Comment |
Gas basicity | 763.9 | kJ/mol | N/A | Hunter and Lias, 1998 | HL |
Ionization energy determinations
IE (eV) | Method | Reference | Comment |
---|---|---|---|
8.72 | EI | McLoughlin, Morrison, et al., 1979 | LLK |
8.725 ± 0.008 | EQ | Lias and Ausloos, 1978 | LLK |
8.69 ± 0.01 | PI | Watanabe, 1957 | RDSH |
~8.76 | S | Hammond, Price, et al., 1950 | RDSH |
8.71 | PE | Howell, Goncalves, et al., 1984 | Vertical value; LBLHLM |
8.75 | PE | Shudo, Kobayashi, et al., 1977 | Vertical value; LLK |
8.98 | PE | Bruckmann and Klessinger, 1974 | Vertical value; LLK |
Appearance energy determinations
Ion | AE (eV) | Other Products | Method | Reference | Comment |
---|---|---|---|---|---|
C7H7+ | 9.91 | C2H5 | EI | McLoughlin, Morrison, et al., 1979 | LLK |
C8H9+ | 10.02 | CH3 | EI | McLoughlin, Morrison, et al., 1979 | LLK |
C8H9+ | 10.65 | CH3 | EI | Howe and Williams, 1969 | RDSH |
De-protonation reactions
C9H11- + =
By formula: C9H11- + H+ = C9H12
Quantity | Value | Units | Method | Reference | Comment |
---|---|---|---|---|---|
ΔrH° | 1585. ± 8.8 | kJ/mol | G+TS | Bartmess, Scott, et al., 1979 | gas phase; value altered from reference due to change in acidity scale; B |
Quantity | Value | Units | Method | Reference | Comment |
ΔrG° | 1560. ± 8.4 | kJ/mol | IMRE | Bartmess, Scott, et al., 1979 | gas phase; value altered from reference due to change in acidity scale; B |

Ion clustering data

Data compiled as indicated in comments:
B - John E. Bartmess
M - Michael M. Meot-Ner (Mautner) and Sharon G. Lias
Clustering reactions
By formula: Cl- + C9H12 = (Cl- • C9H12)
Quantity | Value | Units | Method | Reference | Comment |
---|---|---|---|---|---|
ΔrG° | 5.50 | kcal/mol | TDEq | French, Ikuta, et al., 1982 | gas phase; B |
Free energy of reaction
ΔrG° (kcal/mol) | T (K) | Method | Reference | Comment |
---|---|---|---|---|
5.0 | 300. | PHPMS | French, Ikuta, et al., 1982 | gas phase; M |
By formula: NO- + C9H12 = (NO- • C9H12)
Quantity | Value | Units | Method | Reference | Comment |
---|---|---|---|---|---|
ΔrH° | 45.1 | kcal/mol | ICR | Reents and Freiser, 1981 | gas phase; switching reaction,Thermochemical ladder(NO+)C2H5OH, Entropy change calculated or estimated; Farid and McMahon, 1978; M |

Normal alkane RI, polar column, custom temperature program

Data compiled by: NIST Mass Spectrometry Data Center, William E. Wallace, director

Column type CapillaryCapillaryCapillaryCapillaryCapillary
Active phase HP-InnowaxInnowax FSCCarbowax 20MDB-WaxPEG-20M
Column length (m) 60.60. 30.
Carrier gas HeliumHe
Substrate
Column diameter (mm) 0.250.25 0.53
Phase thickness (μm) 0.250.25 1.0
Program not specified60C(10min) => 4C/min => 220C (10min) => 1C/min => 240Cnot specified40 0C (4 min) 4 0C/min -> 200 0C (20 min)not specified
I 1171.1183.1155.1182.1177.
ReferenceFeng, Zhuang, et al., 2011Baser K.H.C., Ozek G., et al., 2006Ivanciuc, Ivanciuc, et al., 2001Peng, 1996Xiuhua, Zhang, et al., 1996
Comment MSDC-RI MSDC-RI MSDC-RI MSDC-RI MSDC-RI
Column type CapillaryCapillaryCapillaryCapillary
Active phase DB-WaxCarbowax 20MCarbowax 400, Carbowax 20M, Carbowax 1540, Carbowax 4000, Superox 06, PEG 20M, etc.Carbowax 20M
Column length (m)   50.
Carrier gas   Hydrogen
Substrate
Column diameter (mm)   0.32
Phase thickness (μm)
Program not specifiednot specifiednot specifiednot specified
I 1182.1164.1161.1162.
ReferencePeng, Yang, et al., 1991Dimov and Mekenyan, 1989Waggott and Davies, 1984Ramsey and Flanagan, 1982
Comment MSDC-RI MSDC-RI MSDC-RI MSDC-RI

Kovats' RI, polar column, isothermal

Data compiled by: NIST Mass Spectrometry Data Center, William E. Wallace, director

Column type CapillaryCapillaryPackedPackedCapillary
Active phase Carbowax 20MPEG-20MCarbowax 20MCarbowax 20MCarbowax 20M
Column length (m) 15.30.  100.
Carrier gas HeN2  N2
Substrate   Chromosorb GChromosorb G
Column diameter (mm) 0.50.3  0.23
Phase thickness (μm)
Temperature (C) 150.70.115.115.100.
I 1158.1176.91202.11203.61169.8
ReferenceEgazaryants and Maximov, 1998Tóth, 1983Ellis and Still, 1979Ellis and Still, 1979Engewald and Wennrich, 1976
Comment MSDC-RI MSDC-RI MSDC-RI MSDC-RI MSDC-RI
Column type CapillaryPackedPackedPackedPacked
Active phase Carbowax 20MPEG-2000PEG-2000Polyethylene Glycol 4000Polyethylene Glycol 4000
Column length (m) 100.3.3.6.6.
Carrier gas  HeHe
Substrate  Celite 545 (44-60 mesh)Celite 545 (44-60 mesh)Chromosorb PChromosorb P
Column diameter (mm) 0.2
Phase thickness (μm)
Temperature (C) 90.152.179.100.120.
I 1154.91232.1236.1198.1205.
ReferenceDöring, Estel, et al., 1974Anderson, Jurel, et al., 1973Anderson, Jurel, et al., 1973Bonastre and Grenier, 1967Bonastre and Grenier, 1967
Comment MSDC-RI MSDC-RI MSDC-RI MSDC-RI MSDC-RI
Column type PackedPacked
Active phase Polyethylene Glycol 4000Polyethylene Glycol 4000
Column length (m) 6.6.
Carrier gas
Substrate Chromosorb PChromosorb P
Column diameter (mm)
Phase thickness (μm)
Temperature (C) 140.80.
I 1213.1191.
ReferenceBonastre and Grenier, 1967Bonastre and Grenier, 1967
Comment MSDC-RI MSDC-RI

References

Prosen, Gilmont, et al., 1945
Prosen, E.J.; Gilmont, R.; Rossini, F.D.,
Heats of combustion of benzene, toluene, ethyl-benzene, o-xylene, m-xylene, p-xylene, n-propylbenzene, and styrene,
J. Res. NBS, 1945, 34, 65-70. [all data]
Prosen, Johnson, et al., 1946
Prosen, E.J.; Johnson, W.H.; Rossini, F.D.,
Heats of combustion and formation at 25°C of the alkylbenzenes through C10H14, and of the higher normal monoalkylbenzenes,
J. Res. NBS, 1946, 36, 455-461. [all data]
Kishimoto K., 1973
Kishimoto K.,
Calorimetric study of the glassy state. VIII. Heat capacity and relaxational phenomena of isopropylbenzene,
Bull Chem. Soc. Japan, 1973, 46, 3020-3031. [all data]
Richards and Barry, 1915
Richards, T.W.; Barry, F.,
The heats of combustion of aromatic hydrocarbons and hexamethylene,
J. Am. Chem. Soc., 1915, 37, 993-1020. [all data]
Kishimoto, Suga, et al., 1973
Kishimoto, K.; Suga, H.; Syuzo, S.,
Calorimetric study of the glassy state. VIII. Heat capacity and relaxational phenomena of isopropylbenzene,
Bull. Chem. Soc. Japan, 1973, 46, 3020-3031. [all data]
Andolenko and Grigor'ev, 1979
Andolenko, R.A.; Grigor'ev, B.A.,
Investigation of isobaric heat capacity of aromatic hydrocarbons at atmospheric pressure, Iaz. Vyssh. Ucheb. Zaved.,
Neft i Gaz (11), 1979, 78, 90. [all data]
Schlinger and Sage, 1952
Schlinger, W.G.; Sage, B.H.,
Isobaric heat capacities at bubble point. cis-2-butene, isopropylbenzene, and n-decane,
Ind. Eng. Chem., 1952, 44, 2454-2456. [all data]
Kurbatov, 1947
Kurbatov, V.Ya.,
Specific heat of liquids. I. Specific heat of benzenoid hydrocarbons,
Zhur. Obshch. Khim., 1947, 17, 1999-2003. [all data]
de Kolossowsky and Udowenko, 1934
de Kolossowsky, N.; Udowenko, W.W.,
Determination des chaleurs specifiques des liquides,
Compt. rend., 1934, 198, 1394-1395. [all data]
Kolosovskii and Udovenko, 1934
Kolosovskii, N.A.; Udovenko, W.W.,
Specific heat of liquids. II.,
Zhur. Obshchei Khim., 1934, 4, 1027-1033. [all data]
Kishimoto, Suga, et al., 1973, 2
Kishimoto, K.; Suga, H.; Seki, S.,
Calorimetric Study of the Glassy State. VIII. Heat Capacity and Relaxational Phenomena of Isopropylbenzene,
Bull. Chem. Soc. Japan, 1973, 46, 10, 3020, https://doi.org/10.1246/bcsj.46.3020
. [all data]
Tsonopoulos and Ambrose, 1995
Tsonopoulos, C.; Ambrose, D.,
Vapor-Liquid Critical Properties of Elements and Compounds. 3. Aromatic Hydrocarbons,
J. Chem. Eng. Data, 1995, 40, 547-558. [all data]
Ambrose and Grant, 1957
Ambrose, D.; Grant, D.G.,
The Critical Temperatures of Some Hydrocarbons and Pyridine Bases,
Trans. Faraday Soc., 1957, 53, 771. [all data]
Glaser and Ruland, 1957
Glaser, F.; Ruland, H.,
Untersuchungsen über dampfdruckkurven und kritische daten einiger technisch wichtiger organischer substanzen,
Chem. Ing. Techn., 1957, 29, 772. [all data]
Altschul, 1893
Altschul, M.,
The critical values of some organic compounds,
Z. Phys. Chem., Stoechiom. Verwandtschaftsl., 1893, 11, 577. [all data]
Ambrose, Broderick, et al., 1967
Ambrose, D.; Broderick, B.E.; Townsend, R.,
The Vapour Pressures above the Normal Boiling Point and the Critical Pressures of Some Aromatic Hydrocarbons,
J. Chem. Soc. , 1967, 1967, 1967, 633-41. [all data]
Hales and Townsend, 1972
Hales, J.L.; Townsend, R.,
Liquid Densities from 293 to 490 K of Nine Aromatic Hydrocarbons,
J. Chem. Thermodyn., 1972, 4, 763-72. [all data]
Cepeda, Gonzalez, et al., 1989
Cepeda, Emilio; Gonzalez, Cristina; Resa, Jose M.,
Isobaric vapor-liquid equilibrium for the cumene-phenol system,
J. Chem. Eng. Data, 1989, 34, 3, 270-273, https://doi.org/10.1021/je00057a004
. [all data]
Stephenson and Malanowski, 1987
Stephenson, Richard M.; Malanowski, Stanislaw,
Handbook of the Thermodynamics of Organic Compounds, 1987, https://doi.org/10.1007/978-94-009-3173-2
. [all data]
Forziati, Norris, et al., 1949
Forziati, Alphonse F.; Norris, William R.; Rossini, Frederick D.,
Vapor pressures and boiling points of sixty API-NBS hydrocarbons,
J. RES. NATL. BUR. STAN., 1949, 43, 6, 555-17, https://doi.org/10.6028/jres.043.050
. [all data]
Willingham, Taylor, et al., 1945
Willingham, C.B.; Taylor, W.J.; Pignocco, J.M.; Rossini, F.D.,
Vapor pressures and boiling points of some paraffin, alkylcyclopentane, alkylcyclohexane, and alkylbenzene hydrocarbons,
J. RES. NATL. BUR. STAN., 1945, 35, 3, 219-17, https://doi.org/10.6028/jres.035.009
. [all data]
Williamham, Taylor, et al., 1945
Williamham, C.B.; Taylor, W.J.; Pignocco, J.M.; Rossini, F.D.,
Vapor Pressures and Boiling Points of Some Paraffin, Alkylcyclopentane, Alkylcyclohexane, and Alkylbenzene Hydrocarbons,
J. Res. Natl. Bur. Stand. (U.S.), 1945, 35, 3, 219-244, https://doi.org/10.6028/jres.035.009
. [all data]
Bartmess, Scott, et al., 1979
Bartmess, J.E.; Scott, J.A.; McIver, R.T., Jr.,
The gas phase acidity scale from methanol to phenol,
J. Am. Chem. Soc., 1979, 101, 6047. [all data]
Reents and Freiser, 1981
Reents, W.D.; Freiser, B.S.,
Gas-Phase Binding Energies and Spectroscopic Properties of NO+ Charge-Transfer Complexes,
J. Am. Chem. Soc., 1981, 103, 2791. [all data]
Farid and McMahon, 1978
Farid, R.; McMahon, T.B.,
Gas-Phase Ion-Molecule Reactions of Alkyl Nitrites by Ion Cyclotron Resonance Spectroscopy,
Int. J. Mass Spectrom. Ion Phys., 1978, 27, 2, 163, https://doi.org/10.1016/0020-7381(78)80037-0
. [all data]
French, Ikuta, et al., 1982
French, M.A.; Ikuta, S.; Kebarle, P.,
Hydrogen bonding of O-H and C-H hydrogen donors to Cl-. Results from mass spectrometric measurement of the ion-molecule equilibria RH + Cl- = RHCl-,
Can. J. Chem., 1982, 60, 1907. [all data]
Abboud, Jimenez, et al., 1995
Abboud, J.-L.M.; Jimenez, P.; Roux, M.V.; Turrion, C.; Lopez-Mardomingo, C.; Podosenin, A.; Rogers, D.W.; Liebman, J.F.,
Interrelations of the energetics of amides and alkenes: enthalpies of formation of N,N-dimethyl dertivatives of pivalamide, 1-adamantylcarboxamide and benzamide, and of styrene and its a-, trans-β- and β,β-methylated derivates,
J. Phys. Org. Chem., 1995, 8, 15-25. [all data]
Nesterova, Rozhnov, et al., 1985
Nesterova, T.N.; Rozhnov, A.M.; Malova, T.N.; Kovzel, E.N.,
Molar enthalpies of formation of isopropylchlorobenzenes derived from equilibrium measurements,
J. Chem. Thermodyn., 1985, 17, 649-656. [all data]
Tsvetkov, Rozhnov, et al., 1985
Tsvetkov, V.F.; Rozhnov, A.M.; Nesterova, T.N.,
Study of the equilibrium of isomerization and transalkylation of isopropyltoluenes,
Neftekhimiya, 1985, 53-57. [all data]
Popov, Rozhnov, et al., 1974
Popov, V.E.; Rozhnov, A.M.; Satronov, V.S.; Volkova, A.G.,
Disproportionation equilibrium for isopropylbenzene,
Neftekhimiya, 1974, 14, 364-367. [all data]
Miki, 1975
Miki, Y.,
The thermodynamic properties of C9H18 naphthenes. I. The determination of the equilibrium constants of the hydrogenation of propyl- and isopropylbenzene and ethyltoluenes,
Bull. Chem. Soc. Jpn., 1975, 48, 201-208. [all data]
Hunter and Lias, 1998
Hunter, E.P.; Lias, S.G.,
Evaluated Gas Phase Basicities and Proton Affinities of Molecules: An Update,
J. Phys. Chem. Ref. Data, 1998, 27, 3, 413-656, https://doi.org/10.1063/1.556018
. [all data]
McLoughlin, Morrison, et al., 1979
McLoughlin, R.G.; Morrison, J.D.; Traeger, J.C.,
Photoionization of the C-1 - C-4 monosubstituted alkyl benzenes: Thermochemistry of [C7H7]+ and [C8H9]+ formation,
Org. Mass Spectrom., 1979, 14, 104. [all data]
Lias and Ausloos, 1978
Lias, S.G.; Ausloos, P.J.,
eIonization energies of organic compounds by equilibrium measurements,
J. Am. Chem. Soc., 1978, 100, 6027. [all data]
Watanabe, 1957
Watanabe, K.,
Ionization potentials of some molecules,
J. Chem. Phys., 1957, 26, 542. [all data]
Hammond, Price, et al., 1950
Hammond, V.J.; Price, W.C.; Teegan, J.P.; Walsh, A.D.,
The absorption spectra of some substituted benzenes and naphthalenes in the vacuum ultra-violet,
Faraday Discuss. Chem. Soc., 1950, 9, 53. [all data]
Howell, Goncalves, et al., 1984
Howell, J.O.; Goncalves, J.M.; Amatore, C.; Klasinc, L.; Wightman, R.M.; Kochi, J.K.,
Electron transfer from aromatic hydrocarbons and their π-complexes with metals. Comparison of the standard oxidation potentials and vertical ionization potentials,
J. Am. Chem. Soc., 1984, 106, 3968. [all data]
Shudo, Kobayashi, et al., 1977
Shudo, K.; Kobayashi, T.; Utsunomiya, C.,
Photoelectron spectral studies on the interaction of three-membered rings with aryl groups,
Tetrahedron, 1977, 33, 1721. [all data]
Bruckmann and Klessinger, 1974
Bruckmann, P.; Klessinger, M.,
Photoelektronenspektren organischer verbindungen. V. Wechselwirkung kleiner ringe mit π-systemen,
Chem. Ber., 1974, 107, 1108. [all data]
Howe and Williams, 1969
Howe, I.; Williams, D.H.,
Calculation and qualitative predictions of mass spectra. Mono- and paradisubstituted benzenes,
J. Am. Chem. Soc., 1969, 91, 7137. [all data]
Kuskov, et al., 1963
Kuskov, M.M., et al.,
Ultraviolet Absorption Spectra of Aromatic Hydrocarbons, 1963, 45. [all data]