Benzoic acid, p-tert-butyl-
- Formula: C11H14O2
- Molecular weight: 178.2277
- IUPAC Standard InChIKey: KDVYCTOWXSLNNI-UHFFFAOYSA-N
- CAS Registry Number: 98-73-7
- Chemical structure:
View 3d structure (requires JavaScript / HTML 5) - Other names: Benzoic acid, 4-(1,1-dimethylethyl)-; p-tert-Butylbenzoic acid; 4-tert-Butylbenzoic acid; 4-t-Butylbenzoic acid; p-t-Butylbenzoic acid; TBBA; Kyselina p-terc.butylbenzoova; NSC 4802; 4-(1,1-Dimethylethyl)benzoic acid

Gas phase thermochemistry data

Data compiled by: Hussein Y. Afeefy, Joel F. Liebman, and Stephen E. Stein
Quantity | Value | Units | Method | Reference | Comment |
---|---|---|---|---|---|
ΔfH°gas | -398.5 ± 2.0 | kJ/mol | Ccb | Colomina, Jimenez, et al., 1979 |

Condensed phase thermochemistry data

Data compiled by: Hussein Y. Afeefy, Joel F. Liebman, and Stephen E. Stein
Quantity | Value | Units | Method | Reference | Comment |
---|---|---|---|---|---|
ΔfH°solid | -502.9 ± 1.7 | kJ/mol | Ccb | Colomina, Jimenez, et al., 1979 | |
Quantity | Value | Units | Method | Reference | Comment |
ΔcH°solid | -5826.57 ± 0.90 | kJ/mol | Ccb | Colomina, Jimenez, et al., 1979 | Corresponding ΔfHºsolid = -502.85 kJ/mol (simple calculation by NIST; no Washburn corrections) |

Phase change data

Data compiled as indicated in comments:
TRC - Thermodynamics Research Center, NIST Boulder Laboratories, Chris Muzny director
DRB - Donald R. Burgess, Jr.
ALS - Hussein Y. Afeefy, Joel F. Liebman, and Stephen E. Stein
AC - William E. Acree, Jr., James S. Chickos
Quantity | Value | Units | Method | Reference | Comment |
---|---|---|---|---|---|
Tfus | 436.7 | K | N/A | Chickos, Braton, et al., 1991 | Uncertainty assigned by TRC = 0.001 K; TRC |
Tfus | 438.5 | K | N/A | Serijan, Hipsher, et al., 1949 | Uncertainty assigned by TRC = 1. K; TRC |
Tfus | 438.45 | K | N/A | Serijan, Wise, et al., 1949 | Uncertainty assigned by TRC = 0.5 K; TRC |
Quantity | Value | Units | Method | Reference | Comment |
ΔsubH° | 104.4 | kJ/mol | N/A | Colomina, Jimenez, et al., 1979 | DRB |
Enthalpy of sublimation
ΔsubH (kJ/mol) | Temperature (K) | Method | Reference | Comment |
---|---|---|---|---|
104.4 ± 1.0 | 334.1 | V | Colomina, Jimenez, et al., 1979 | ALS |
103.8 ± 0.4 | 334. | ME | Colomina, Jimenez, et al., 1979 | Based on data from 325. to 343. K.; AC |
Enthalpy of fusion
ΔfusH (kJ/mol) | Temperature (K) | Method | Reference | Comment |
---|---|---|---|---|
17.91 | 440. | DSC | Acree, 1993 | AC |

Reaction thermochemistry data

Data compiled by: John E. Bartmess
Individual Reactions
C11H13O2- + =
By formula: C11H13O2- + H+ = C11H14O2
Quantity | Value | Units | Method | Reference | Comment |
---|---|---|---|---|---|
ΔrH° | 1423. ± 9.2 | kJ/mol | G+TS | Kulhanek, Decouzon, et al., 1999 | gas phase |
Quantity | Value | Units | Method | Reference | Comment |
ΔrG° | 1393. ± 8.4 | kJ/mol | IMRE | Kulhanek, Decouzon, et al., 1999 | gas phase |

Gas phase ion energetics data

Data compiled as indicated in comments:
B - John E. Bartmess
LL - Sharon G. Lias and Joel F. Liebman
LBLHLM - Sharon G. Lias, John E. Bartmess, Joel F. Liebman, John L. Holmes, Rhoda D. Levin, and W. Gary Mallard
Ionization energy determinations
IE (eV) | Method | Reference | Comment |
---|---|---|---|
8.94 | PI | Takhistov, Misharev, et al., 1995 | LL |
8.94 ± 0.02 | EI | Orlov, Misharev, et al., 1986 | LBLHLM |
Appearance energy determinations
Ion | AE (eV) | Other Products | Method | Reference | Comment |
---|---|---|---|---|---|
C10H11O2+ | 9.62 | CH3 | PI | Takhistov, Misharev, et al., 1995 | LL |
C10H11O2+ | 9.8 ± 0.1 | CH3 | EI | Orlov, Misharev, et al., 1986 | LBLHLM |
C11H13O+[(CH3)3CC6H4CO+] | 9.59 | OH | EST | Takhistov, Misharev, et al., 1995 | LL |
De-protonation reactions
C11H13O2- + =
By formula: C11H13O2- + H+ = C11H14O2
Quantity | Value | Units | Method | Reference | Comment |
---|---|---|---|---|---|
ΔrH° | 1423. ± 9.2 | kJ/mol | G+TS | Kulhanek, Decouzon, et al., 1999 | gas phase; B |
Quantity | Value | Units | Method | Reference | Comment |
ΔrG° | 1393. ± 8.4 | kJ/mol | IMRE | Kulhanek, Decouzon, et al., 1999 | gas phase; B |

Van Den Dool and Kratz RI, non-polar column, temperature ramp

Column type | Active phase | I | Reference | Comment |
---|---|---|---|---|
Packed | SE-30 | 1486. | Peng, Ding, et al., 1988 | He, Supelcoport and Chromosorb, 40. C @ 4. min, 10. K/min, 250. C @ 60. min; Column length: 3.05 m |

Normal alkane RI, non-polar column, temperature ramp

Column type | Active phase | I | Reference | Comment |
---|---|---|---|---|
Capillary | Ultra-1 | 1472. | Okumura, 1991 | 25. m/0.32 mm/0.25 μm, He, 3. K/min; Tstart: 80. C; Tend: 260. C |

References

Colomina, Jimenez, et al., 1979
Colomina, M.; Jimenez, P.; Perez-Ossorio, R.; Turrion, C.,
Thermochemical properties of benzoic acid derivatives. VIII. Enthalpies of combustion and formation of o-, m-, and p-t-butylbenzoic acids,
J. Chem. Thermodyn., 1979, 11, 1179-1184. [all data]
Chickos, Braton, et al., 1991
Chickos, J.S.; Braton, C.M.; Hesse, D.G.; Liebman, J.F.,
Estimating entropies and enthalpies of fusion of organic compounds,
J. Org. Chem., 1991, 56, 3, 927, https://doi.org/10.1021/jo00003a007
. [all data]
Serijan, Hipsher, et al., 1949
Serijan, K.T.; Hipsher, H.F.; Gibbons, L.C.,
O-, m- and p-t-butyltoluenes,
J. Am. Chem. Soc., 1949, 71, 873-5. [all data]
Serijan, Wise, et al., 1949
Serijan, K.T.; Wise, P.H.; Gibbons, L.C.,
The physical properties of five isomeric methyl-t-butylcyclohexanes,
J. Am. Chem. Soc., 1949, 71, 2265-6. [all data]
Acree, 1993
Acree, William E.,
Thermodynamic properties of organic compounds,
Thermochimica Acta, 1993, 219, 97-104, https://doi.org/10.1016/0040-6031(93)80486-T
. [all data]
Kulhanek, Decouzon, et al., 1999
Kulhanek, J.; Decouzon, M.; Gal, J.F.; Maria, P.C.; Fiedler, P.; Jimenez, P.; Roux, M.V.; Exner, O.,
Steric effects and steric hindrance to resonance in tert-butylbenzoic acids in the gas phase and in solution,
Eur. J. Org., 1999, Chem., 7, 1589-1594, https://doi.org/10.1002/(SICI)1099-0690(199907)1999:7<1589::AID-EJOC1589>3.0.CO;2-S
. [all data]
Takhistov, Misharev, et al., 1995
Takhistov, V.V.; Misharev, A.D.; Orlov, V.M.; Ponomarev, D.A.; Voss, J.,
Thermochemistry and mass spectrometry of aromatic compounds with tertiary alkyl groups,
Eur. Mass Spectrom., 1995, 1, 353. [all data]
Orlov, Misharev, et al., 1986
Orlov, V.; Misharev, A.; Takhistox, V.,
Determination of the enthalpy of formation of para-substituted α,α-dimethyl cations in the gas phase,
Izv. Akad. Nauk SSSR Ser. Khim., 1986, 9, 2006. [all data]
Peng, Ding, et al., 1988
Peng, C.T.; Ding, S.F.; Hua, R.L.; Yang, Z.C.,
Prediction of Retention Indexes I. Structure-Retention Index Relationship on Apolar Columns,
J. Chromatogr., 1988, 436, 137-172, https://doi.org/10.1016/S0021-9673(00)94575-8
. [all data]
Okumura, 1991
Okumura, T.,
retention indices of environmental chemicals on methyl silicone capillary column,
Journal of Environmental Chemistry (Japan), 1991, 1, 2, 333-358, https://doi.org/10.5985/jec.1.333
. [all data]