Benzene, 1-chloro-4-(trifluoromethyl)-
- Formula: C7H4ClF3
- Molecular weight: 180.555
- IUPAC Standard InChIKey: QULYNCCPRWKEMF-UHFFFAOYSA-N
- CAS Registry Number: 98-56-6
- Chemical structure:
View 3d structure (requires JavaScript / HTML 5) - Other names: Toluene, p-chloro-α,α,α-trifluoro-; (p-Chlorophenyl)trifluoromethane; p-(Trifluoromethyl)chlorobenzene; p-Chloro-α,α,α-trifluorotoluene; p-Chlorobenzotrifluoride; p-Chlorotrifluoromethylbenzene; p-Trifluoromethylphenyl chloride; 1-Chloro-4-(trifluoromethyl)benzene; 4-Chloro-α,α,α-trifluorotoluene; 4-Chlorobenzotrifluoride; para-Chlorobenzotrifluoride; 1-(Trifluoromethyl)-4-chlorobenzene; NSC 10309

Condensed phase thermochemistry data

Data compiled by: Hussein Y. Afeefy, Joel F. Liebman, and Stephen E. Stein
Quantity | Value | Units | Method | Reference | Comment |
---|---|---|---|---|---|
ΔfH°solid | -323.7 ± 1.2 | kJ/mol | Ccb | Gambaretto, Scipioni, et al., 1980 | |
Quantity | Value | Units | Method | Reference | Comment |
ΔcH°solid | -3329. ± 13. | kJ/mol | Ccb | Gambaretto, Scipioni, et al., 1980 |

Phase change data

Data compiled as indicated in comments:
BS - Robert L. Brown and Stephen E. Stein
AC - William E. Acree, Jr., James S. Chickos
Quantity | Value | Units | Method | Reference | Comment |
---|---|---|---|---|---|
Tboil | 410.2 | K | N/A | Aldrich Chemical Company Inc., 1990 | BS |
Tboil | 411.7 | K | N/A | Weast and Grasselli, 1989 | BS |
Enthalpy of vaporization
ΔvapH (kJ/mol) | Temperature (K) | Method | Reference | Comment |
---|---|---|---|---|
42.2 | 317. | A | Stephenson and Malanowski, 1987 | Based on data from 302. to 412. K. See also Potter and Saylor, 1951, Dykyj and Vanko, 1970, and Kkykj and Repas, 1973.; AC |

Gas phase ion energetics data

Data compiled as indicated in comments:
LLK - Sharon G. Lias, Rhoda D. Levin, and Sherif A. Kafafi
RDSH - Henry M. Rosenstock, Keith Draxl, Bruce W. Steiner, and John T. Herron
Ionization energy determinations
IE (eV) | Method | Reference | Comment |
---|---|---|---|
9.8 ± 0.1 | EI | Brown, 1970 | RDSH |
9.56 | PE | Gounelle, Jullien, et al., 1975 | Vertical value; LLK |
9.80 | PE | Baker, May, et al., 1968 | Vertical value; RDSH |
Appearance energy determinations
Ion | AE (eV) | Other Products | Method | Reference | Comment |
---|---|---|---|---|---|
C7H4F3+ | 12.9 ± 0.1 | Cl | EI | Brown, 1970 | RDSH |

Van Den Dool and Kratz RI, non-polar column, temperature ramp

Column type | Active phase | I | Reference | Comment |
---|---|---|---|---|
Capillary | OV-1 | 836.3 | Gautzsch and Zinn, 1996 | 8. K/min; Tstart: 35. C; Tend: 300. C |
Capillary | OV-1 | 836.3 | Gautzsch and Zinn, 1996 | 8. K/min; Tstart: 35. C; Tend: 300. C |

Van Den Dool and Kratz RI, polar column, temperature ramp

Column type | Active phase | I | Reference | Comment |
---|---|---|---|---|
Capillary | Carbowax | 1178.4 | Censullo, Jones, et al., 2003 | 60. m/0.25 mm/0.5 μm, He, 50. C @ 10. min, 5. K/min, 250. C @ 10. min |

References

Gambaretto, Scipioni, et al., 1980
Gambaretto, G.; Scipioni, A.; Conte, L.,
Determination of the heats of formation and nitration of 3-nitro-4-chlorobenzotrifluoride and 3,5-dinitro-4-chlorobenzotrifluoride,
Atti - Ist. Veneto Sci., Lett. Arti, Cl. Sci. Fis., Mat. Nat., 1980, 138, 189-194. [all data]
Aldrich Chemical Company Inc., 1990
Aldrich Chemical Company Inc.,
Catalog Handbook of Fine Chemicals, Aldrich Chemical Company, Inc., Milwaukee WI, 1990, 1. [all data]
Weast and Grasselli, 1989
CRC Handbook of Data on Organic Compounds, 2nd Editon, Weast,R.C and Grasselli, J.G., ed(s)., CRC Press, Inc., Boca Raton, FL, 1989, 1. [all data]
Stephenson and Malanowski, 1987
Stephenson, Richard M.; Malanowski, Stanislaw,
Handbook of the Thermodynamics of Organic Compounds, 1987, https://doi.org/10.1007/978-94-009-3173-2
. [all data]
Potter and Saylor, 1951
Potter, John C.; Saylor, John H.,
The Vapor Pressures and Freezing Points of Some Organic Fluorine Compounds 1,2,
J. Am. Chem. Soc., 1951, 73, 1, 90-91, https://doi.org/10.1021/ja01145a032
. [all data]
Dykyj and Vanko, 1970
Dykyj, J.; Vanko, A.,
Petrochemica, 1970, 10, 1, 3. [all data]
Kkykj and Repas, 1973
Kkykj, J.; Repas, M.,
Petrochemia, 1973, 13, 179. [all data]
Brown, 1970
Brown, P.,
Kinetic studies in mass spectrometry-IV. The [M - Cl] reaction in substituted chlorobenzenes and the question of molecular ion isomerization,
Org. Mass Spectrom., 1970, 3, 639. [all data]
Gounelle, Jullien, et al., 1975
Gounelle, Y.; Jullien, J.; Solgadi, D.; Botter, R.; Menes, F.,
No. 157. - Effets de l'isomerie sur les potentiels d'ionisation: Spectres des photoelectrons de dihalogeno-benzenes,
J. Chim. Phys., 1975, 10, 1094. [all data]
Baker, May, et al., 1968
Baker, A.D.; May, D.P.; Turner, D.W.,
Molecular photoelectron spectroscopy. Part VII. The vertical ionisation potentials of benzene and some of its monosubstituted and 1,4-disubstituted derivatives,
J. Chem. Soc. B, 1968, 22. [all data]
Gautzsch and Zinn, 1996
Gautzsch, R.; Zinn, P.,
Use of incremental models to estimate the retention indexes of aromatic compounds,
Chromatographia, 1996, 43, 3/4, 163-176, https://doi.org/10.1007/BF02292946
. [all data]
Censullo, Jones, et al., 2003
Censullo, A.C.; Jones, D.R.; Wills, M.T.,
Speciation of the volatile organic compounds (VOCs) in solventborne aerosol coatings by solid phase microextraction-gas chromatography,
J. Coat. Technol., 2003, 75, 936, 47-53, https://doi.org/10.1007/BF02697922
. [all data]