Cyclohexanone, 4-(1,1-dimethylethyl)-
- Formula: C10H18O
- Molecular weight: 154.2493
- IUPAC Standard InChIKey: YKFKEYKJGVSEIX-UHFFFAOYSA-N
- CAS Registry Number: 98-53-3
- Chemical structure:
View 3d structure (requires JavaScript / HTML 5) - Other names: Cyclohexanone, 4-tert-butyl-; γ-tert-Butylcyclohexanone; p-tert-Butylcyclohexanone; C 64; 4-tert-Butylcyclohexanone; Cyclohexanone, p-tert-butyl-; 4-t-Butylcyclohexanone; NSC 73717

Phase change data

Data compiled as indicated in comments:
BS - Robert L. Brown and Stephen E. Stein
TRC - Thermodynamics Research Center, NIST Boulder Laboratories, Chris Muzny director
Quantity | Value | Units | Method | Reference | Comment |
---|---|---|---|---|---|
Tfus | 321.2 | K | N/A | Winstein and Holness, 1955 | Uncertainty assigned by TRC = 3. K; TRC |
Reduced pressure boiling point
Tboil (K) | Pressure (bar) | Reference | Comment |
---|---|---|---|
387.7 | 0.027 | Aldrich Chemical Company Inc., 1990 | BS |
364.2 | 0.01 | Weast and Grasselli, 1989 | BS |
383. to 385. | 0.024 | Frinton Laboratories Inc., 1986 | BS |

Gas phase ion energetics data

Data compiled by: Sharon G. Lias, Rhoda D. Levin, and Sherif A. Kafafi
Ionization energy determinations
IE (eV) | Method | Reference |
---|---|---|
9.04 | PE | Loudet, Grimaud, et al., 1976 |

Normal alkane RI, non-polar column, custom temperature program

Column type | Active phase | I | Reference | Comment |
---|---|---|---|---|
Capillary | SE-30 | 1208. | Vinogradov, 2004 | Program: not specified |

Normal alkane RI, polar column, custom temperature program

Column type | Active phase | I | Reference | Comment |
---|---|---|---|---|
Capillary | Carbowax 20M | 1645. | Vinogradov, 2004 | Program: not specified |

References

Winstein and Holness, 1955
Winstein, S.; Holness, N.J.,
Neighboring Carbon and Hydrogen XIX. t-Butylcyclohexyl Derivatives Quantitative Conformational Analysis,
J. Am. Chem. Soc., 1955, 77, 5562. [all data]
Aldrich Chemical Company Inc., 1990
Aldrich Chemical Company Inc.,
Catalog Handbook of Fine Chemicals, Aldrich Chemical Company, Inc., Milwaukee WI, 1990, 1. [all data]
Weast and Grasselli, 1989
CRC Handbook of Data on Organic Compounds, 2nd Editon, Weast,R.C and Grasselli, J.G., ed(s)., CRC Press, Inc., Boca Raton, FL, 1989, 1. [all data]
Frinton Laboratories Inc., 1986
Frinton Laboratories Inc.,
Catalog Number 11, Frinton Laboratories Inc., Vineland, NJ, 1986, 99. [all data]
Loudet, Grimaud, et al., 1976
Loudet, M.; Grimaud, M.; Metras, F.; Pfister-Guillouzo, G.,
Interactions intramoleculaires en serie cyclohexanique partie II. Spectres photoelectroniques de chloro-2-cyclohexanones,
J. Mol. Struct., 1976, 35, 213. [all data]
Vinogradov, 2004
Vinogradov, B.A.,
Production, composition, properties and application of essential oils, 2004, retrieved from http://viness.narod.ru. [all data]