Benzene, 1-chloro-3-(trifluoromethyl)-
- Formula: C7H4ClF3
- Molecular weight: 180.555
- IUPAC Standard InChIKey: YTCGOUNVIAWCMG-UHFFFAOYSA-N
- CAS Registry Number: 98-15-7
- Chemical structure:
View 3d structure (requires JavaScript / HTML 5) - Other names: 3-Chlorobenzotrifluoride; m-Chlorobenzotrifluoride; m-Chloro-α,α,α-trifluorotoluene; m-Trifluoromethylphenyl chloride; meta(Trifluoromethyl)chlorobenzene; Toluene, m-chloro-α,α,α-trifluoro-; 1-Chloro-3-(trifluoromethyl)benzene; 3-Chloro-α,α,α-trifluorotoluene; UN 2234

Phase change data

Data compiled as indicated in comments:
BS - Robert L. Brown and Stephen E. Stein
TRC - Thermodynamics Research Center, NIST Boulder Laboratories, Chris Muzny director
AC - William E. Acree, Jr., James S. Chickos
Quantity | Value | Units | Method | Reference | Comment |
---|---|---|---|---|---|
Tboil | 410.7 | K | N/A | Aldrich Chemical Company Inc., 1990 | BS |
Tboil | 411. | K | N/A | Park, Brown, et al., 1951 | Uncertainty assigned by TRC = 2. K; TRC |
Enthalpy of vaporization
ΔvapH (kJ/mol) | Temperature (K) | Method | Reference | Comment |
---|---|---|---|---|
43.0 | 317. | A | Stephenson and Malanowski, 1987 | Based on data from 302. to 411. K. See also Potter and Saylor, 1951, Dykyj and Vanko, 1970, and Kkykj and Repas, 1973.; AC |

Gas phase ion energetics data

Data compiled as indicated in comments:
LLK - Sharon G. Lias, Rhoda D. Levin, and Sherif A. Kafafi
RDSH - Henry M. Rosenstock, Keith Draxl, Bruce W. Steiner, and John T. Herron
Ionization energy determinations
IE (eV) | Method | Reference | Comment |
---|---|---|---|
9.8 ± 0.1 | EI | Brown, 1970 | RDSH |
9.50 | PE | Gounelle, Jullien, et al., 1975 | Vertical value; LLK |
Appearance energy determinations
Ion | AE (eV) | Other Products | Method | Reference | Comment |
---|---|---|---|---|---|
C7H4F3+ | 13.0 ± 0.1 | Cl | EI | Brown, 1970 | RDSH |

References

Aldrich Chemical Company Inc., 1990
Aldrich Chemical Company Inc.,
Catalog Handbook of Fine Chemicals, Aldrich Chemical Company, Inc., Milwaukee WI, 1990, 1. [all data]
Park, Brown, et al., 1951
Park, J.D.; Brown, H.A.; Lacher, J.R.,
Directed Halogenation in Fluorinated Aromatic Compounds,
J. Am. Chem. Soc., 1951, 73, 709-11. [all data]
Stephenson and Malanowski, 1987
Stephenson, Richard M.; Malanowski, Stanislaw,
Handbook of the Thermodynamics of Organic Compounds, 1987, https://doi.org/10.1007/978-94-009-3173-2
. [all data]
Potter and Saylor, 1951
Potter, John C.; Saylor, John H.,
The Vapor Pressures and Freezing Points of Some Organic Fluorine Compounds 1,2,
J. Am. Chem. Soc., 1951, 73, 1, 90-91, https://doi.org/10.1021/ja01145a032
. [all data]
Dykyj and Vanko, 1970
Dykyj, J.; Vanko, A.,
Petrochemica, 1970, 10, 1, 3. [all data]
Kkykj and Repas, 1973
Kkykj, J.; Repas, M.,
Petrochemia, 1973, 13, 179. [all data]
Brown, 1970
Brown, P.,
Kinetic studies in mass spectrometry-IV. The [M - Cl] reaction in substituted chlorobenzenes and the question of molecular ion isomerization,
Org. Mass Spectrom., 1970, 3, 639. [all data]
Gounelle, Jullien, et al., 1975
Gounelle, Y.; Jullien, J.; Solgadi, D.; Botter, R.; Menes, F.,
No. 157. - Effets de l'isomerie sur les potentiels d'ionisation: Spectres des photoelectrons de dihalogeno-benzenes,
J. Chim. Phys., 1975, 10, 1094. [all data]