Benzene, (trifluoromethyl)-
- Formula: C7H5F3
- Molecular weight: 146.1098
- IUPAC Standard InChIKey: GETTZEONDQJALK-UHFFFAOYSA-N
- CAS Registry Number: 98-08-8
- Chemical structure:
View 3d structure (requires JavaScript / HTML 5) - Other names: Toluene, α,α,α-trifluoro-; α,α,α-Trifluorotoluene; (Trifluoromethyl)benzene; Benzenyl fluoride; Benzotrifluoride; Benzylidyne fluoride; Phenylfluoroform; USAF MA-16; UN 2338; alpha,alpha,alpha-Trifluorotoluene; NSC 8038; Trifluoro(phenyl)methane

Gas phase thermochemistry data

Data compiled by: Hussein Y. Afeefy, Joel F. Liebman, and Stephen E. Stein
Quantity | Value | Units | Method | Reference | Comment |
---|---|---|---|---|---|
ΔfH°gas | -581.03 | kJ/mol | Cm | Scott, Douslin, et al., 1959 | hfusion=3.294±0.001 kcal/mol |

Condensed phase thermochemistry data

Data compiled as indicated in comments:
ALS - Hussein Y. Afeefy, Joel F. Liebman, and Stephen E. Stein
DH - Eugene S. Domalski and Elizabeth D. Hearing
Quantity | Value | Units | Method | Reference | Comment |
---|---|---|---|---|---|
ΔfH°liquid | -620.45 | kJ/mol | Ccr | Good, Lacina, et al., 1964 | ALS |
Quantity | Value | Units | Method | Reference | Comment |
ΔcH°liquid | -3369.3 ± 0.50 | kJ/mol | Ccr | Good, Lacina, et al., 1964 | ALS |
ΔcH°liquid | -3390.5 | kJ/mol | Ccb | Swarts, 1919 | Not corrected for CODATA value of ΔfH; ALS |
Quantity | Value | Units | Method | Reference | Comment |
S°liquid | 271.50 | J/mol*K | N/A | Scott, Douslin, et al., 1959, 2 | DH |
Constant pressure heat capacity of liquid
Cp,liquid (J/mol*K) | Temperature (K) | Reference | Comment |
---|---|---|---|
188.45 | 298.15 | Scott, Douslin, et al., 1959, 2 | T = 12 to 365 K.; DH |

Phase change data

Data compiled as indicated in comments:
TRC - Thermodynamics Research Center, NIST Boulder Laboratories, Chris Muzny director
BS - Robert L. Brown and Stephen E. Stein
AC - William E. Acree, Jr., James S. Chickos
ALS - Hussein Y. Afeefy, Joel F. Liebman, and Stephen E. Stein
DH - Eugene S. Domalski and Elizabeth D. Hearing
Quantity | Value | Units | Method | Reference | Comment |
---|---|---|---|---|---|
Tboil | 375.0 ± 0.8 | K | AVG | N/A | Average of 7 values; Individual data points |
Quantity | Value | Units | Method | Reference | Comment |
Tfus | 244.0 | K | N/A | Dreisbach, 1955 | Uncertainty assigned by TRC = 0.02 K; TRC |
Quantity | Value | Units | Method | Reference | Comment |
Ttriple | 244.14 | K | N/A | Scott, Douslin, et al., 1959, 3 | Uncertainty assigned by TRC = 0.02 K; TRC |
Ttriple | 244.14 | K | N/A | McCullough and Waddington, 1957 | Uncertainty assigned by TRC = 0.07 K; IPTS-48; TRC |
Quantity | Value | Units | Method | Reference | Comment |
Tc | 559.9 | K | N/A | Majer and Svoboda, 1985 | |
Quantity | Value | Units | Method | Reference | Comment |
ΔvapH° | 37.67 | kJ/mol | N/A | Majer and Svoboda, 1985 | |
ΔvapH° | 37.1 | kJ/mol | N/A | Boublik, Fried, et al., 1984 | Based on data from 330. to 410. K. See also Basarová and Svoboda, 1991.; AC |
ΔvapH° | 37.6 | kJ/mol | V | Scott, Douslin, et al., 1959 | hfusion=3.294±0.001 kcal/mol; ALS |
Enthalpy of vaporization
ΔvapH (kJ/mol) | Temperature (K) | Method | Reference | Comment |
---|---|---|---|---|
32.63 | 375.2 | N/A | Majer and Svoboda, 1985 | |
35.6 | 343. | N/A | Dykyj, Svoboda, et al., 1999 | Based on data from 328. to 413. K.; AC |
31.6 | 483. | N/A | Dykyj, Svoboda, et al., 1999 | Based on data from 468. to 532. K.; AC |
35.9 | 338. | I | Jadot and Fraiha, 1992 | Based on data from 323. to 384. K.; AC |
35.7 | 343. | A,EB | Stephenson and Malanowski, 1987 | Based on data from 328. to 413. K. See also Potter and Saylor, 1951, Dykyj and Vanko, 1970, and Scott, Douslin, et al., 1959, 4.; AC |
32.4 | 475. | N/A | Mousa, 1985 | Based on data from 460. to 530. K.; AC |
35.4 ± 0.1 | 334. | C | Scott, Douslin, et al., 1959, 4 | AC |
34.1 ± 0.1 | 353. | C | Scott, Douslin, et al., 1959, 4 | AC |
32.6 ± 0.1 | 375. | C | Scott, Douslin, et al., 1959, 4 | AC |
39.1 | 256. | N/A | Stull, 1947 | Based on data from 241. to 375. K.; AC |
38.5 | 290. | N/A | Field and Saylor, 1946 | Based on data from 275. to 353. K.; AC |
Enthalpy of vaporization
ΔvapH =
A exp(-βTr) (1 − Tr)β
ΔvapH =
Enthalpy of vaporization (at saturation pressure)
(kJ/mol)
Tr = reduced temperature (T / Tc)
View plot Requires a JavaScript / HTML 5 canvas capable browser.
Temperature (K) | A (kJ/mol) | β | Tc (K) | Reference | Comment |
---|---|---|---|---|---|
334. to 375. | 54.79 | 0.2912 | 559.9 | Majer and Svoboda, 1985 |
Antoine Equation Parameters
log10(P) = A − (B / (T + C))
P = vapor pressure (bar)
T = temperature (K)
View plot Requires a JavaScript / HTML 5 canvas capable browser.
Temperature (K) | A | B | C | Reference | Comment |
---|---|---|---|---|---|
328. to 412.32 | 4.09418 | 1305.612 | -55.858 | Scott, Douslin, et al., 1959, 4 | Coefficents calculated by NIST from author's data. |
241. to 375.3 | 4.30697 | 1439.695 | -40.702 | Stull, 1947 | Coefficents calculated by NIST from author's data. |
Enthalpy of sublimation
ΔsubH (kJ/mol) | Temperature (K) | Method | Reference | Comment |
---|---|---|---|---|
54.4 | 227. | MG | Sears and Hopke, 1948 | Based on data from 222. to 233. K.; AC |
Enthalpy of fusion
ΔfusH (kJ/mol) | Temperature (K) | Method | Reference | Comment |
---|---|---|---|---|
13.782 | 244.14 | N/A | Scott, Douslin, et al., 1959, 2 | DH |
13.77 | 244. | N/A | Domalski and Hearing, 1996 | AC |
11.99 | 242. | DSC | Ahmed and Eades, 1972 | AC |
Entropy of fusion
ΔfusS (J/mol*K) | Temperature (K) | Reference | Comment |
---|---|---|---|
56.45 | 244.14 | Scott, Douslin, et al., 1959, 2 | DH |

Reaction thermochemistry data

Data compiled as indicated in comments:
B - John E. Bartmess
M - Michael M. Meot-Ner (Mautner) and Sharon G. Lias
Individual Reactions
By formula: Br- + C7H5F3 = (Br- • C7H5F3)
Quantity | Value | Units | Method | Reference | Comment |
---|---|---|---|---|---|
ΔrH° | 52.7 ± 7.5 | kJ/mol | IMRE | Paul and Kebarle, 1991 | gas phase; ΔGaff measured at 303 K, corrected to 423 K, ΔSaff taken as that of PhNO2..Br-; B |
ΔrH° | 108. | kJ/mol | PHPMS | Paul and Kebarle, 1990 | gas phase; switching reaction,Thermochemical ladder(Br-)C6H5OH, Entropy change calculated or estimated; M |
Quantity | Value | Units | Method | Reference | Comment |
ΔrS° | 96. | J/mol*K | N/A | Paul and Kebarle, 1990 | gas phase; switching reaction,Thermochemical ladder(Br-)C6H5OH, Entropy change calculated or estimated; M |
Quantity | Value | Units | Method | Reference | Comment |
ΔrG° | 17. ± 4.2 | kJ/mol | IMRE | Paul and Kebarle, 1991 | gas phase; ΔGaff measured at 303 K, corrected to 423 K, ΔSaff taken as that of PhNO2..Br-; B |
Free energy of reaction
ΔrG° (kJ/mol) | T (K) | Method | Reference | Comment |
---|---|---|---|---|
66.9 | 423. | PHPMS | Paul and Kebarle, 1990 | gas phase; switching reaction,Thermochemical ladder(Br-)C6H5OH, Entropy change calculated or estimated; M |
C7H4F3- + =
By formula: C7H4F3- + H+ = C7H5F3
Quantity | Value | Units | Method | Reference | Comment |
---|---|---|---|---|---|
ΔrH° | 1620. ± 10. | kJ/mol | TDEq | Meot-ner and Kafafi, 1988 | gas phase; anchored to 88MEO scale, not the "87 acidity scale". The Kiefer, Zhang, et al., 1997 BDE is for ortho.; B |
Quantity | Value | Units | Method | Reference | Comment |
ΔrG° | 1584. ± 8.4 | kJ/mol | TDEq | Meot-ner and Kafafi, 1988 | gas phase; anchored to 88MEO scale, not the "87 acidity scale". The Kiefer, Zhang, et al., 1997 BDE is for ortho.; B |
ΔrG° | 1586. ± 21. | kJ/mol | IMRB | Bartmess and McIver Jr., 1979 | gas phase; B |
By formula: C6H7N+ + C7H5F3 = (C6H7N+ • C7H5F3)
Bond type: Charge transfer bond (positive ion)
Quantity | Value | Units | Method | Reference | Comment |
---|---|---|---|---|---|
ΔrH° | 49.4 | kJ/mol | PHPMS | Meot-Ner (Mautner) and El-Shall, 1986 | gas phase; Entropy change calculated or estimated; M |
Quantity | Value | Units | Method | Reference | Comment |
ΔrS° | 110. | J/mol*K | N/A | Meot-Ner (Mautner) and El-Shall, 1986 | gas phase; Entropy change calculated or estimated; M |
Free energy of reaction
ΔrG° (kJ/mol) | T (K) | Method | Reference | Comment |
---|---|---|---|---|
17. | 300. | PHPMS | Meot-Ner (Mautner) and El-Shall, 1986 | gas phase; Entropy change calculated or estimated; M |
By formula: NO- + C7H5F3 = (NO- • C7H5F3)
Quantity | Value | Units | Method | Reference | Comment |
---|---|---|---|---|---|
ΔrH° | 150. | kJ/mol | ICR | Reents and Freiser, 1981 | gas phase; switching reaction,Thermochemical ladder(NO+)C2H5OH, Entropy change calculated or estimated; Farid and McMahon, 1978; M |

Henry's Law data

Data compiled by: Rolf Sander
Henry's Law constant (water solution)
kH(T) = k°H exp(d(ln(kH))/d(1/T) ((1/T) - 1/(298.15 K)))
k°H = Henry's law constant for solubility in water at 298.15 K (mol/(kg*bar))
d(ln(kH))/d(1/T) = Temperature dependence constant (K)
k°H (mol/(kg*bar)) | d(ln(kH))/d(1/T) (K) | Method | Reference | Comment |
---|---|---|---|---|
0.061 | Q | N/A | missing citation give several references for the Henry's law constants but don't assign them to specific species. | |
0.063 | L | N/A |

Gas phase ion energetics data

Data evaluated as indicated in comments:
L - Sharon G. Lias
Data compiled as indicated in comments:
B - John E. Bartmess
LBLHLM - Sharon G. Lias, John E. Bartmess, Joel F. Liebman, John L. Holmes, Rhoda D. Levin, and W. Gary Mallard
LLK - Sharon G. Lias, Rhoda D. Levin, and Sherif A. Kafafi
RDSH - Henry M. Rosenstock, Keith Draxl, Bruce W. Steiner, and John T. Herron
Quantity | Value | Units | Method | Reference | Comment |
---|---|---|---|---|---|
IE (evaluated) | 9.685 ± 0.005 | eV | N/A | N/A | L |
Electron affinity determinations
EA (eV) | Method | Reference | Comment |
---|---|---|---|
0.00221 | EFD | Desfrancois, Abdoul-Carime, et al., 1994 | EA: 2.2 meV. Dipole-bound state.; B |
Ionization energy determinations
IE (eV) | Method | Reference | Comment |
---|---|---|---|
9.7 | PE | Peel and Von Nagy-Felsobuki, 1987 | LBLHLM |
9.69 ± 0.03 | PI | Berman, Bomse, et al., 1981 | LLK |
9.685 ± 0.004 | EQ | Lias and Ausloos, 1978 | LLK |
9.68 | PE | Behan, Johnstone, et al., 1976 | LLK |
9.68 ± 0.02 | PI | Watanabe, Nakayama, et al., 1962 | RDSH |
9.685 ± 0.005 | S | Hammond, Price, et al., 1950 | RDSH |
9.86 | PE | Peel and Von Nagy-Felsobuki, 1987 | Vertical value; LBLHLM |
Appearance energy determinations
Ion | AE (eV) | Other Products | Method | Reference | Comment |
---|---|---|---|---|---|
C6H5+ | 15.2 ± 0.1 | ? | EI | Majer and Patrick, 1962 | RDSH |
C6H5F+ | 12.4 ± 0.1 | CF2 | PI | Berman, Bomse, et al., 1981 | LLK |
De-protonation reactions
C7H4F3- + =
By formula: C7H4F3- + H+ = C7H5F3
Quantity | Value | Units | Method | Reference | Comment |
---|---|---|---|---|---|
ΔrH° | 1620. ± 10. | kJ/mol | TDEq | Meot-ner and Kafafi, 1988 | gas phase; anchored to 88MEO scale, not the "87 acidity scale". The Kiefer, Zhang, et al., 1997 BDE is for ortho.; B |
Quantity | Value | Units | Method | Reference | Comment |
ΔrG° | 1584. ± 8.4 | kJ/mol | TDEq | Meot-ner and Kafafi, 1988 | gas phase; anchored to 88MEO scale, not the "87 acidity scale". The Kiefer, Zhang, et al., 1997 BDE is for ortho.; B |
ΔrG° | 1586. ± 21. | kJ/mol | IMRB | Bartmess and McIver Jr., 1979 | gas phase; B |

Ion clustering data

Data compiled as indicated in comments:
B - John E. Bartmess
M - Michael M. Meot-Ner (Mautner) and Sharon G. Lias
Clustering reactions
By formula: Br- + C7H5F3 = (Br- • C7H5F3)
Quantity | Value | Units | Method | Reference | Comment |
---|---|---|---|---|---|
ΔrH° | 52.7 ± 7.5 | kJ/mol | IMRE | Paul and Kebarle, 1991 | gas phase; ΔGaff measured at 303 K, corrected to 423 K, ΔSaff taken as that of PhNO2..Br-; B |
ΔrH° | 108. | kJ/mol | PHPMS | Paul and Kebarle, 1990 | gas phase; switching reaction,Thermochemical ladder(Br-)C6H5OH, Entropy change calculated or estimated; M |
Quantity | Value | Units | Method | Reference | Comment |
ΔrS° | 96. | J/mol*K | N/A | Paul and Kebarle, 1990 | gas phase; switching reaction,Thermochemical ladder(Br-)C6H5OH, Entropy change calculated or estimated; M |
Quantity | Value | Units | Method | Reference | Comment |
ΔrG° | 17. ± 4.2 | kJ/mol | IMRE | Paul and Kebarle, 1991 | gas phase; ΔGaff measured at 303 K, corrected to 423 K, ΔSaff taken as that of PhNO2..Br-; B |
Free energy of reaction
ΔrG° (kJ/mol) | T (K) | Method | Reference | Comment |
---|---|---|---|---|
66.9 | 423. | PHPMS | Paul and Kebarle, 1990 | gas phase; switching reaction,Thermochemical ladder(Br-)C6H5OH, Entropy change calculated or estimated; M |
By formula: C6H7N+ + C7H5F3 = (C6H7N+ • C7H5F3)
Bond type: Charge transfer bond (positive ion)
Quantity | Value | Units | Method | Reference | Comment |
---|---|---|---|---|---|
ΔrH° | 49.4 | kJ/mol | PHPMS | Meot-Ner (Mautner) and El-Shall, 1986 | gas phase; Entropy change calculated or estimated; M |
Quantity | Value | Units | Method | Reference | Comment |
ΔrS° | 110. | J/mol*K | N/A | Meot-Ner (Mautner) and El-Shall, 1986 | gas phase; Entropy change calculated or estimated; M |
Free energy of reaction
ΔrG° (kJ/mol) | T (K) | Method | Reference | Comment |
---|---|---|---|---|
17. | 300. | PHPMS | Meot-Ner (Mautner) and El-Shall, 1986 | gas phase; Entropy change calculated or estimated; M |
By formula: NO- + C7H5F3 = (NO- • C7H5F3)
Quantity | Value | Units | Method | Reference | Comment |
---|---|---|---|---|---|
ΔrH° | 150. | kJ/mol | ICR | Reents and Freiser, 1981 | gas phase; switching reaction,Thermochemical ladder(NO+)C2H5OH, Entropy change calculated or estimated; Farid and McMahon, 1978; M |

Kovats' RI, non-polar column, isothermal

Column type | Active phase | Temperature (C) | I | Reference | Comment |
---|---|---|---|---|---|
Packed | C78, Branched paraffin | 130. | 656.3 | Dallos, Sisak, et al., 2000 | He; Column length: 3.3 m |
Packed | C78, Branched paraffin | 130. | 656.4 | Reddy, Dutoit, et al., 1992 | Chromosorb G HP; Column length: 3.3 m |

Van Den Dool and Kratz RI, non-polar column, temperature ramp

Column type | Active phase | I | Reference | Comment |
---|---|---|---|---|
Capillary | OV-1 | 696.0 | Gautzsch and Zinn, 1996 | 8. K/min; Tstart: 35. C; Tend: 300. C |

Normal alkane RI, non-polar column, custom temperature program

Column type | Active phase | I | Reference | Comment |
---|---|---|---|---|
Capillary | Methyl Silicone | 700. | Zenkevich, 1995 | Program: not specified |

References

Scott, Douslin, et al., 1959
Scott, D.W.; Douslin, D.R.; Messerly, J.F.; Todd, S.S.; Hossenlopp, I.A.; Kincheloe, T.C.; McCullough, J.P.,
Benzotrifluoride: Chemical thermodynamic properties and internal rotation,
J. Am. Chem. Soc., 1959, 81, 1015-10. [all data]
Good, Lacina, et al., 1964
Good, W.D.; Lacina, J.L.; DePrater, B.L.; McCullough, J.P.,
A new approach to the combustion calorimetry of silicon and organosilicon compounds. Heats of formation of quartz, fluorosilicic acid, and hexamethyldisiloxane,
J. Phys. Chem., 1964, 68, 579-586. [all data]
Swarts, 1919
Swarts, F.,
Etudes thermochimiques sur les combinaisons organiques fluorees,
J. Chim. Phys., 1919, 17, 3-70. [all data]
Scott, Douslin, et al., 1959, 2
Scott, D.W.; Douslin, D.R.; Messerly, J.F.; Todd, S.S.; Hossenlopp, I.A.; Kincheloe, T.C.; McCullough, J.P.,
Benzotrifluoride: chemical thermodynamic properties and internal rotation,
J. Am. Chem. Soc., 1959, 81, 1015-1017. [all data]
Dreisbach, 1955
Dreisbach, R.R.,
Physical Properties of Chemical Compounds, Advances in Chemistry Series No. 15, Am. Chem. Soc.: Washington, D. C., 1955. [all data]
Scott, Douslin, et al., 1959, 3
Scott, D.W.; Douslin, D.R.; Messerly, J.F.; Todd, S.S.; Hossenlopp, I.A.; Kincheloe, T.C.; McCullough, J.P.,
Benzotrifluoride: Chemical Thermodynamic Prop. and Internal Rotation,
J. Am. Chem. Soc., 1959, 81, 1015-20. [all data]
McCullough and Waddington, 1957
McCullough, J.P.; Waddington, G.,
Melting-point purity determinations: limitations as evidenced by calorimetric studies in the melting region,
Anal. Chim. Acta, 1957, 17, 80. [all data]
Majer and Svoboda, 1985
Majer, V.; Svoboda, V.,
Enthalpies of Vaporization of Organic Compounds: A Critical Review and Data Compilation, Blackwell Scientific Publications, Oxford, 1985, 300. [all data]
Boublik, Fried, et al., 1984
Boublik, T.; Fried, V.; Hala, E.,
The Vapour Pressures of Pure Substances: Selected Values of the Temperature Dependence of the Vapour Pressures of Some Pure Substances in the Normal and Low Pressure Region, 2nd ed., Elsevier, New York, 1984, 972. [all data]
Basarová and Svoboda, 1991
Basarová, Pavlína; Svoboda, Václav,
Calculation of heats of vaporization of halogenated hydrocarbons from saturated vapour pressure data,
Fluid Phase Equilibria, 1991, 68, 13-34, https://doi.org/10.1016/0378-3812(91)85008-I
. [all data]
Dykyj, Svoboda, et al., 1999
Dykyj, J.; Svoboda, J.; Wilhoit, R.C.; Frenkel, M.L.; Hall, K.R.,
Vapor Pressure of Chemicals: Part A. Vapor Pressure and Antoine Constants for Hydrocarbons and Sulfur, Selenium, Tellurium and Hydrogen Containing Organic Compounds, Springer, Berlin, 1999, 373. [all data]
Jadot and Fraiha, 1992
Jadot, Roger; Fraiha, Mustapha,
Isobaric vapor-liquid equilibrium of (trifluoromethyl)benzene with benzene, toluene, or chlorobenzene,
J. Chem. Eng. Data, 1992, 37, 4, 509-511, https://doi.org/10.1021/je00008a031
. [all data]
Stephenson and Malanowski, 1987
Stephenson, Richard M.; Malanowski, Stanislaw,
Handbook of the Thermodynamics of Organic Compounds, 1987, https://doi.org/10.1007/978-94-009-3173-2
. [all data]
Potter and Saylor, 1951
Potter, John C.; Saylor, John H.,
The Vapor Pressures and Freezing Points of Some Organic Fluorine Compounds 1,2,
J. Am. Chem. Soc., 1951, 73, 1, 90-91, https://doi.org/10.1021/ja01145a032
. [all data]
Dykyj and Vanko, 1970
Dykyj, J.; Vanko, A.,
Petrochemica, 1970, 10, 1, 3. [all data]
Scott, Douslin, et al., 1959, 4
Scott, D.W.; Douslin, D.R.; Messerly, J.F.; Todd, S.S.; Hossenlopp, I.A.; Kincheloe, T.C.; McCullough, J.P.,
Benzotrifluoride: Chemical Thermodynamic Properties and Internal Rotation 1,
J. Am. Chem. Soc., 1959, 81, 5, 1015-1020, https://doi.org/10.1021/ja01514a001
. [all data]
Mousa, 1985
Mousa, A.H.N.,
The vapour pressures and saturated volumes of benzotrifluoride in the temperature range 460--530K.,
Journal of Fluorine Chemistry, 1985, 30, 1, 29-35, https://doi.org/10.1016/S0022-1139(00)80520-5
. [all data]
Stull, 1947
Stull, Daniel R.,
Vapor Pressure of Pure Substances. Organic and Inorganic Compounds,
Ind. Eng. Chem., 1947, 39, 4, 517-540, https://doi.org/10.1021/ie50448a022
. [all data]
Field and Saylor, 1946
Field, Frank H.; Saylor, John H.,
The Vapor Pressures of Some Organic Fluorides 1,2,
J. Am. Chem. Soc., 1946, 68, 12, 2649-2650, https://doi.org/10.1021/ja01216a068
. [all data]
Sears and Hopke, 1948
Sears, G.W.; Hopke, E.R.,
The Vapor Pressure of Benzotrifluoride Measured by the Rodebush Manometer,
J. Phys. Chem., 1948, 52, 7, 1137-1142, https://doi.org/10.1021/j150463a004
. [all data]
Domalski and Hearing, 1996
Domalski, Eugene S.; Hearing, Elizabeth D.,
Heat Capacities and Entropies of Organic Compounds in the Condensed Phase. Volume III,
J. Phys. Chem. Ref. Data, 1996, 25, 1, 1, https://doi.org/10.1063/1.555985
. [all data]
Ahmed and Eades, 1972
Ahmed, A.M.I.; Eades, R.G.,
Proton magnetic relaxation in toluene and some derivatives,
J. Chem. Soc., Faraday Trans. 2, 1972, 68, 1623, https://doi.org/10.1039/f29726801623
. [all data]
Paul and Kebarle, 1991
Paul, G.J.C.; Kebarle, P.,
Stabilities of Complexes of Br- with Substituted Benzenes (SB) Based on Determinations of the Gas-Phase Equilibria Br- + SB = (BrSB)-,
J. Am. Chem. Soc., 1991, 113, 4, 1148, https://doi.org/10.1021/ja00004a014
. [all data]
Paul and Kebarle, 1990
Paul, G.J.C.; Kebarle, P.,
Stabilities in the Gas Phase of the Hydrogen Bonded Complexes, YC6H4OH-X-, of Substituted Phenols, YC6H4OH, with the Halide Anions X-(Cl-, Br-),
Can. J. Chem., 1990, 68, 11, 2070, https://doi.org/10.1139/v90-316
. [all data]
Meot-ner and Kafafi, 1988
Meot-ner, M.; Kafafi, S.A.,
Carbon Acidities of Aromatic Compounds,
J. Am. Chem. Soc., 1988, 110, 19, 6297, https://doi.org/10.1021/ja00227a003
. [all data]
Kiefer, Zhang, et al., 1997
Kiefer, J.H.; Zhang, Q.; Kern, R.D.; Yao, J.; Jursic, B.,
Pyrolysis of Aromatic Azines: Pyrazine, Pyrimidine, and Pyridine,
J. Phys. Chem. A, 1997, 101, 38, 7061, https://doi.org/10.1021/jp970211z
. [all data]
Bartmess and McIver Jr., 1979
Bartmess, J.E.; McIver Jr.,
The Gas Phase Acidity Scale
in Gas Phase Ion Chemistry, Gas Phase Ion Chemistry, V. 2, M.T. Bowers, Ed., Academic Press, NY, 1979, Ch. 11, Elsevier, 1979. [all data]
Meot-Ner (Mautner) and El-Shall, 1986
Meot-Ner (Mautner), M.; El-Shall, M.S.,
Ionic Charge Transfer Complexes. 1. Cationic Complexes with Delocalized and Partially Localized pi Systems,
J. Am. Chem. Soc., 1986, 108, 15, 4386, https://doi.org/10.1021/ja00275a026
. [all data]
Reents and Freiser, 1981
Reents, W.D.; Freiser, B.S.,
Gas-Phase Binding Energies and Spectroscopic Properties of NO+ Charge-Transfer Complexes,
J. Am. Chem. Soc., 1981, 103, 2791. [all data]
Farid and McMahon, 1978
Farid, R.; McMahon, T.B.,
Gas-Phase Ion-Molecule Reactions of Alkyl Nitrites by Ion Cyclotron Resonance Spectroscopy,
Int. J. Mass Spectrom. Ion Phys., 1978, 27, 2, 163, https://doi.org/10.1016/0020-7381(78)80037-0
. [all data]
Desfrancois, Abdoul-Carime, et al., 1994
Desfrancois, C.; Abdoul-Carime, H.; Khelifa, N.; Schermann, J.P.,
Fork 1/r to 1/r2 Potentials: Electron Exchange between Rydberg Atoms and Polar Molecules,
Phys. Rev. Lett., 1994, 73, 18, 2436, https://doi.org/10.1103/PhysRevLett.73.2436
. [all data]
Peel and Von Nagy-Felsobuki, 1987
Peel, J.B.; Von Nagy-Felsobuki, E.I.,
The photoelectron spectra of the fluorotoluenes,
J. Mol. Struct., 1987, 159, 195. [all data]
Berman, Bomse, et al., 1981
Berman, D.W.; Bomse, D.S.; Beauchamp, J.L.,
Photoionization threshold measurements for CF2 loss from perfluoropropylene, Perfluorocyclopropane, and trifluoromethylbenzene. The heat of formation of CF2 and the potential energy surface for C3F6 neutrals and ions,
Int. J. Mass Spectrom. Ion Phys., 1981, 39, 263. [all data]
Lias and Ausloos, 1978
Lias, S.G.; Ausloos, P.J.,
eIonization energies of organic compounds by equilibrium measurements,
J. Am. Chem. Soc., 1978, 100, 6027. [all data]
Behan, Johnstone, et al., 1976
Behan, J.M.; Johnstone, R.A.W.; Bentley, T.W.,
An evaluation of empirical methods for calculating the ionization potentials of substituted benzenes,
Org. Mass Spectrom., 1976, 11, 207. [all data]
Watanabe, Nakayama, et al., 1962
Watanabe, K.; Nakayama, T.; Mottl, J.,
Ionization potentials of some molecules,
J. Quant. Spectry. Radiative Transfer, 1962, 2, 369. [all data]
Hammond, Price, et al., 1950
Hammond, V.J.; Price, W.C.; Teegan, J.P.; Walsh, A.D.,
The absorption spectra of some substituted benzenes and naphthalenes in the vacuum ultra-violet,
Faraday Discuss. Chem. Soc., 1950, 9, 53. [all data]
Majer and Patrick, 1962
Majer, J.R.; Patrick, C.R.,
Electron impact on some halogenated aromatic compounds,
J. Chem. Soc. Faraday Trans., 1962, 58, 17. [all data]
Dallos, Sisak, et al., 2000
Dallos, A.; Sisak, A.; Kulcsár, Z.; Kováts, E.,
Pair-wise interactions by gas chromatography VII. Interaction free enthalpies of solutes with secondary alcohol groups,
J. Chromatogr. A, 2000, 904, 2, 211-242, https://doi.org/10.1016/S0021-9673(00)00908-0
. [all data]
Reddy, Dutoit, et al., 1992
Reddy, K.S.; Dutoit, J.-Cl.; Kovats, E. sz.,
Pair-wise interactions by gas chromatography. I. Interaction free enthalpies of solutes with non-associated primary alcohol groups,
J. Chromatogr., 1992, 609, 1-2, 229-259, https://doi.org/10.1016/0021-9673(92)80167-S
. [all data]
Gautzsch and Zinn, 1996
Gautzsch, R.; Zinn, P.,
Use of incremental models to estimate the retention indexes of aromatic compounds,
Chromatographia, 1996, 43, 3/4, 163-176, https://doi.org/10.1007/BF02292946
. [all data]
Zenkevich, 1995
Zenkevich, I.G.,
Calculation of Gas-Chromatographic Retention Indices from Physico-Chemical Constants of Organic Compounds,
Z. Anal. Chem., 1995, 50, 10, 1048-1056. [all data]