Benzene, (trichloromethyl)-
- Formula: C7H5Cl3
- Molecular weight: 195.474
- IUPAC Standard InChIKey: XEMRAKSQROQPBR-UHFFFAOYSA-N
- CAS Registry Number: 98-07-7
- Chemical structure:
View 3d structure (requires JavaScript / HTML 5) - Species with the same structure:
- Other names: Toluene, α,α,α-trichloro-; Trichlorotoluene; (Trichloromethyl)benzene; Benzenyl trichloride; Benzotrichloride; Benzyl trichloride; Benzylidyne chloride; Phenylchloroform; Phenyltrichloromethane; Toluene trichloride; Trichlorophenylmethane; 1-(Trichloromethyl)benzene; Benzenyl chloride; α,α,α-Trichlorotoluene; ω,ω,ω-Trichlorotoluene; Chlorure de benzenyle; Trichloormethylbenzeen; Trichlormethylbenzol; Triclorometilbenzene; Benzoic trichloride; Rcra waste number U023; UN 2226; α,α,α-Trichloromethylbenzene; NSC 14663

Phase change data

Data compiled as indicated in comments:
BS - Robert L. Brown and Stephen E. Stein
TRC - Thermodynamics Research Center, NIST Boulder Laboratories, Chris Muzny director
AC - William E. Acree, Jr., James S. Chickos
DH - Eugene S. Domalski and Elizabeth D. Hearing
Quantity | Value | Units | Method | Reference | Comment |
---|---|---|---|---|---|
Tboil | 493.8 | K | N/A | Weast and Grasselli, 1989 | BS |
Quantity | Value | Units | Method | Reference | Comment |
Tfus | 235.99 | K | N/A | Goates, Boerio-Goates, et al., 1987 | Uncertainty assigned by TRC = 0.1 K; TRC |
Tfus | 256.2 | K | N/A | Altschul and Von Schneider, 1895 | Uncertainty assigned by TRC = 0.6 K; TRC |
Enthalpy of vaporization
ΔvapH (kJ/mol) | Temperature (K) | Method | Reference | Comment |
---|---|---|---|---|
52.0 | 333. | A | Stephenson and Malanowski, 1987 | Based on data from 318. to 487. K. See also Stull, 1947.; AC |
Antoine Equation Parameters
log10(P) = A − (B / (T + C))
P = vapor pressure (bar)
T = temperature (K)
View plot Requires a JavaScript / HTML 5 canvas capable browser.
Temperature (K) | A | B | C | Reference | Comment |
---|---|---|---|---|---|
318.9 to 486.7 | 4.82927 | 2166.28 | -37.699 | Stull, 1947 | Coefficents calculated by NIST from author's data. |
Enthalpy of fusion
ΔfusH (kJ/mol) | Temperature (K) | Method | Reference | Comment |
---|---|---|---|---|
13.95 | 236. | N/A | Domalski and Hearing, 1996 | AC |
10.6 | 270. | DSC | Ahmed and Eades, 1972 | There is a large discrepancy in the two melting points. The 270 K value is correct; AC |
Enthalpy of phase transition
ΔHtrs (kJ/mol) | Temperature (K) | Initial Phase | Final Phase | Reference | Comment |
---|---|---|---|---|---|
13.950 | 235.99 | crystaline, I | liquid | Goates, Boerio-Goates, et al., 1987, 2 | DH |
Entropy of phase transition
ΔStrs (J/mol*K) | Temperature (K) | Initial Phase | Final Phase | Reference | Comment |
---|---|---|---|---|---|
59.11 | 235.99 | crystaline, I | liquid | Goates, Boerio-Goates, et al., 1987, 2 | DH |

Reaction thermochemistry data

Data compiled as indicated in comments:
B - John E. Bartmess
M - Michael M. Meot-Ner (Mautner) and Sharon G. Lias
Individual Reactions
By formula: Br- + C7H5Cl3 = (Br- • C7H5Cl3)
Quantity | Value | Units | Method | Reference | Comment |
---|---|---|---|---|---|
ΔrH° | 51.9 ± 7.5 | kJ/mol | IMRE | Paul and Kebarle, 1991 | gas phase; ΔGaff measured at 303 K, corrected to 423 K, ΔSaff taken as that of PhNO2..Br-; B,M |
Quantity | Value | Units | Method | Reference | Comment |
ΔrS° | 84. | J/mol*K | N/A | Paul and Kebarle, 1991 | gas phase; Entropy change calculated or estimated; M |
Quantity | Value | Units | Method | Reference | Comment |
ΔrG° | 16. ± 4.2 | kJ/mol | IMRE | Paul and Kebarle, 1991 | gas phase; ΔGaff measured at 303 K, corrected to 423 K, ΔSaff taken as that of PhNO2..Br-; B |
Free energy of reaction
ΔrG° (kJ/mol) | T (K) | Method | Reference | Comment |
---|---|---|---|---|
16. | 423. | PHPMS | Paul and Kebarle, 1991 | gas phase; Entropy change calculated or estimated; M |

Gas phase ion energetics data

Data compiled by: Sharon G. Lias, Rhoda D. Levin, and Sherif A. Kafafi
Ionization energy determinations
IE (eV) | Method | Reference | Comment |
---|---|---|---|
9.60 | PE | Zverev and Ermolaeva, 1981 | Vertical value |

Ion clustering data

Data compiled as indicated in comments:
B - John E. Bartmess
M - Michael M. Meot-Ner (Mautner) and Sharon G. Lias
Clustering reactions
By formula: Br- + C7H5Cl3 = (Br- • C7H5Cl3)
Quantity | Value | Units | Method | Reference | Comment |
---|---|---|---|---|---|
ΔrH° | 51.9 ± 7.5 | kJ/mol | IMRE | Paul and Kebarle, 1991 | gas phase; ΔGaff measured at 303 K, corrected to 423 K, ΔSaff taken as that of PhNO2..Br-; B,M |
Quantity | Value | Units | Method | Reference | Comment |
ΔrS° | 84. | J/mol*K | N/A | Paul and Kebarle, 1991 | gas phase; Entropy change calculated or estimated; M |
Quantity | Value | Units | Method | Reference | Comment |
ΔrG° | 16. ± 4.2 | kJ/mol | IMRE | Paul and Kebarle, 1991 | gas phase; ΔGaff measured at 303 K, corrected to 423 K, ΔSaff taken as that of PhNO2..Br-; B |
Free energy of reaction
ΔrG° (kJ/mol) | T (K) | Method | Reference | Comment |
---|---|---|---|---|
16. | 423. | PHPMS | Paul and Kebarle, 1991 | gas phase; Entropy change calculated or estimated; M |

Van Den Dool and Kratz RI, non-polar column, temperature ramp

Column type | Active phase | I | Reference | Comment |
---|---|---|---|---|
Capillary | DB-1 | 1187.4 | Sun and Stremple, 2003 | 30. m/0.25 mm/0.25 μm, He, 3. K/min; Tstart: 40. C; Tend: 325. C |
Capillary | OV-1 | 1200.0 | Gautzsch and Zinn, 1996 | 8. K/min; Tstart: 35. C; Tend: 300. C |

Normal alkane RI, non-polar column, temperature ramp

Column type | Active phase | I | Reference | Comment |
---|---|---|---|---|
Capillary | OV-101 | 1211. | Zenkevich, Eliseenkov, et al., 2006 | Nitrogen, 6. K/min, 240. C @ 10. min; Column length: 25. m; Column diameter: 0.20 mm; Tstart: 60. C |

References

Weast and Grasselli, 1989
CRC Handbook of Data on Organic Compounds, 2nd Editon, Weast,R.C and Grasselli, J.G., ed(s)., CRC Press, Inc., Boca Raton, FL, 1989, 1. [all data]
Goates, Boerio-Goates, et al., 1987
Goates, J.R.; Boerio-Goates, J.; Goates, S.R.; Ott, J.B.,
(Solid + Liquid) Phase Equilibria for (N,N-Dimethylacetamide + Tetra- chloromethane): Enthalpies of Meltingof Pure Compounds and Enthalpies for Formation of Moelcular Addition Compounds from Phase Eq,
J. Chem. Thermodyn., 1987, 19, 103. [all data]
Altschul and Von Schneider, 1895
Altschul, M.; Von Schneider, B.,
Freezing points of some organic fluids,
Z. Phys. Chem., Stoechiom. Verwandtschaftsl., 1895, 16, 24. [all data]
Stephenson and Malanowski, 1987
Stephenson, Richard M.; Malanowski, Stanislaw,
Handbook of the Thermodynamics of Organic Compounds, 1987, https://doi.org/10.1007/978-94-009-3173-2
. [all data]
Stull, 1947
Stull, Daniel R.,
Vapor Pressure of Pure Substances. Organic and Inorganic Compounds,
Ind. Eng. Chem., 1947, 39, 4, 517-540, https://doi.org/10.1021/ie50448a022
. [all data]
Domalski and Hearing, 1996
Domalski, Eugene S.; Hearing, Elizabeth D.,
Heat Capacities and Entropies of Organic Compounds in the Condensed Phase. Volume III,
J. Phys. Chem. Ref. Data, 1996, 25, 1, 1, https://doi.org/10.1063/1.555985
. [all data]
Ahmed and Eades, 1972
Ahmed, A.M.I.; Eades, R.G.,
Proton magnetic relaxation in toluene and some derivatives,
J. Chem. Soc., Faraday Trans. 2, 1972, 68, 1623, https://doi.org/10.1039/f29726801623
. [all data]
Goates, Boerio-Goates, et al., 1987, 2
Goates, J.R.; Boerio-Goates, J.; Goates, S.R.; Ott, J.B.,
(Solid + liquid) phase equilibria for (N,N-dimethylacetamide + tetrachloromethane): enthalpies of melting of pure components and enthalpies for formation of molecular addition compounds from phase equilibria,
J. Chem. Thermodynam., 1987, 19, 103-107. [all data]
Paul and Kebarle, 1991
Paul, G.J.C.; Kebarle, P.,
Stabilities of Complexes of Br- with Substituted Benzenes (SB) Based on Determinations of the Gas-Phase Equilibria Br- + SB = (BrSB)-,
J. Am. Chem. Soc., 1991, 113, 4, 1148, https://doi.org/10.1021/ja00004a014
. [all data]
Zverev and Ermolaeva, 1981
Zverev, V.V.; Ermolaeva, L.V.,
Ionization potentials and intramolecular charge transfer. II. The photoelectron spectrum and electronic structure of trichloromethylbenzene,
Zh. Strukt. Khim., 1981, 22, 22. [all data]
Sun and Stremple, 2003
Sun, G.; Stremple, P.,
Retention index characterization of flavor, fragrance, and many other compounds on DB-1 and DB-XLB, 2003, retrieved from http://www.chem.agilent.com/cag/cabu/pdf/b-0279.pdf. [all data]
Gautzsch and Zinn, 1996
Gautzsch, R.; Zinn, P.,
Use of incremental models to estimate the retention indexes of aromatic compounds,
Chromatographia, 1996, 43, 3/4, 163-176, https://doi.org/10.1007/BF02292946
. [all data]
Zenkevich, Eliseenkov, et al., 2006
Zenkevich, I.G.; Eliseenkov, E.V.; Kasatochkin, A.N.,
Application of Retention Indices in GC-MS Identification of Halogenated Organic Compounds,
Mass Spectromery (Rus.), 2006, 3, 2, 131-140. [all data]