Benzene, tert-butyl-
- Formula: C10H14
- Molecular weight: 134.2182
- IUPAC Standard InChIKey: YTZKOQUCBOVLHL-UHFFFAOYSA-N
- CAS Registry Number: 98-06-6
- Chemical structure:
View 3d structure (requires JavaScript / HTML 5) - Other names: Benzene, (1,1-dimethylethyl)-; tert-Butylbenzene; Dimethylethylbenzene; Phenyltrimethylmethane; Pseudobutylbenzene; Trimethylphenylmethane; 2-Methyl-2-Phenylpropane; 1,1-Dimethylethyl-benzene; t-Butylbenzene; 2-Phenyl-2-methylpropane; Benzene, t-butyl-; NSC 6557; α-dimethylethylbenzene

Gas phase thermochemistry data

Data compiled by: Hussein Y. Afeefy, Joel F. Liebman, and Stephen E. Stein
Quantity | Value | Units | Method | Reference | Comment |
---|---|---|---|---|---|
ΔfH°gas | -5.42 ± 0.34 | kcal/mol | Ccb | Prosen, Johnson, et al., 1946 |

Condensed phase thermochemistry data

Data compiled as indicated in comments:
ALS - Hussein Y. Afeefy, Joel F. Liebman, and Stephen E. Stein
DH - Eugene S. Domalski and Elizabeth D. Hearing
Quantity | Value | Units | Method | Reference | Comment |
---|---|---|---|---|---|
ΔfH°liquid | -16.92 ± 0.30 | kcal/mol | Ccb | Prosen, Johnson, et al., 1946 | ALS |
Quantity | Value | Units | Method | Reference | Comment |
ΔcH°liquid | -1401.82 ± 0.27 | kcal/mol | Ccb | Prosen, Johnson, et al., 1946 | Corresponding ΔfHºliquid = -16.90 kcal/mol (simple calculation by NIST; no Washburn corrections); ALS |
ΔcH°liquid | -1399.80 | kcal/mol | Ccb | Richards and Davis, 1920 | At 291 K; Corresponding ΔfHºliquid = -18.92 kcal/mol (simple calculation by NIST; no Washburn corrections); ALS |
ΔcH°liquid | -1400.5 | kcal/mol | Ccb | Richards and Barry, 1915 | At 291 K; Corresponding ΔfHºliquid = -18.2 kcal/mol (simple calculation by NIST; no Washburn corrections); ALS |
Quantity | Value | Units | Method | Reference | Comment |
S°liquid | 66.61 | cal/mol*K | N/A | Huffman, Parks, et al., 1930 | Extrapolation below 90 K, 67.70 J/mol*K.; DH |
Constant pressure heat capacity of liquid
Cp,liquid (cal/mol*K) | Temperature (K) | Reference | Comment |
---|---|---|---|
56.910 | 294.3 | Huffman, Parks, et al., 1930 | T = 92 to 294 K. Value is unsmoothed experimental datum.; DH |

Phase change data

Data compiled as indicated in comments:
BS - Robert L. Brown and Stephen E. Stein
TRC - Thermodynamics Research Center, NIST Boulder Laboratories, Chris Muzny director
AC - William E. Acree, Jr., James S. Chickos
DRB - Donald R. Burgess, Jr.
DH - Eugene S. Domalski and Elizabeth D. Hearing
Quantity | Value | Units | Method | Reference | Comment |
---|---|---|---|---|---|
Tboil | 442. ± 2. | K | AVG | N/A | Average of 47 out of 48 values; Individual data points |
Quantity | Value | Units | Method | Reference | Comment |
Tfus | 215. ± 2. | K | AVG | N/A | Average of 7 values; Individual data points |
Quantity | Value | Units | Method | Reference | Comment |
Ttriple | 215.0 | K | N/A | Huffman, Parks, et al., 1930, 2 | Uncertainty assigned by TRC = 0.2 K; TRC |
Quantity | Value | Units | Method | Reference | Comment |
ΔvapH° | 11.5 ± 0.3 | kcal/mol | AVG | N/A | Average of 6 values; Individual data points |
Enthalpy of vaporization
ΔvapH (kcal/mol) | Temperature (K) | Method | Reference | Comment |
---|---|---|---|---|
10.8 ± 0.05 | 340. | EB | Steele, Chirico, et al., 2002 | Based on data from 332. to 486. K.; AC |
10.2 ± 0.05 | 380. | EB | Steele, Chirico, et al., 2002 | Based on data from 332. to 486. K.; AC |
9.54 ± 0.07 | 420. | EB | Steele, Chirico, et al., 2002 | Based on data from 332. to 486. K.; AC |
8.8 ± 0.1 | 460. | EB | Steele, Chirico, et al., 2002 | Based on data from 332. to 486. K.; AC |
11.4 ± 0.1 | 293. | GS | Verevkin, 1998 | Based on data from 278. to 308. K.; AC |
10.3 | 383. | A | Stephenson and Malanowski, 1987 | Based on data from 368. to 444. K.; AC |
10.4 | 372. | N/A | Forziati, Norris, et al., 1949 | Based on data from 357. to 443. K.; AC |
Antoine Equation Parameters
log10(P) = A − (B / (T + C))
P = vapor pressure (atm)
T = temperature (K)
View plot Requires a JavaScript / HTML 5 canvas capable browser.
Temperature (K) | A | B | C | Reference |
---|---|---|---|---|
357.03 to 443.31 | 4.0397 | 1504.572 | -69.822 | Forziati, Norris, et al., 1949, 2 |
Enthalpy of fusion
ΔfusH (kcal/mol) | Temperature (K) | Method | Reference | Comment |
---|---|---|---|---|
2.0 | 215.3 | DSC,AC | Chirico and Steele, 2009 | AC |
2.01 | 215. | N/A | Domalski and Hearing, 1996 | AC |
2.007 | 215.0 | N/A | Huffman, Parks, et al., 1930 | DH |
Entropy of fusion
ΔfusS (cal/mol*K) | Temperature (K) | Reference | Comment |
---|---|---|---|
9.336 | 215.0 | Huffman, Parks, et al., 1930 | DH |

Reaction thermochemistry data

Data compiled by: Hussein Y. Afeefy, Joel F. Liebman, and Stephen E. Stein
Individual Reactions
By formula: C18H30 + C10H14 = C14H22 + C14H22
Quantity | Value | Units | Method | Reference | Comment |
---|---|---|---|---|---|
ΔrH° | 0.24 ± 0.26 | kcal/mol | Eqk | Nesterova, Verevkin, et al., 1984 | liquid phase; GLC |
By formula: C14H22 + C6H6 = 2C10H14
Quantity | Value | Units | Method | Reference | Comment |
---|---|---|---|---|---|
ΔrH° | -0.72 ± 0.17 | kcal/mol | Eqk | Nesterova, Verevkin, et al., 1984 | liquid phase; GLC |

Gas phase ion energetics data

Data evaluated as indicated in comments:
L - Sharon G. Lias
Data compiled as indicated in comments:
LBLHLM - Sharon G. Lias, John E. Bartmess, Joel F. Liebman, John L. Holmes, Rhoda D. Levin, and W. Gary Mallard
LLK - Sharon G. Lias, Rhoda D. Levin, and Sherif A. Kafafi
RDSH - Henry M. Rosenstock, Keith Draxl, Bruce W. Steiner, and John T. Herron
Quantity | Value | Units | Method | Reference | Comment |
---|---|---|---|---|---|
IE (evaluated) | 8.68 ± 0.03 | eV | N/A | N/A | L |
Ionization energy determinations
IE (eV) | Method | Reference | Comment |
---|---|---|---|
8.69 | PI | Domnin, Lakshin, et al., 1985 | LBLHLM |
8.25 | PE | Baidin, Misharev, et al., 1985 | LBLHLM |
8.63 ± 0.01 | PI | VanderGreef, 1980 | LLK |
8.69 | EI | McLoughlin, Morrison, et al., 1979 | LLK |
8.725 ± 0.008 | EQ | Lias and Ausloos, 1978 | LLK |
8.64 | CTS | Pitt, 1973 | LLK |
8.68 ± 0.01 | PI | Watanabe, Nakayama, et al., 1962 | RDSH |
8.68 ± 0.01 | PI | Price, Bralsford, et al., 1959 | RDSH |
8.81 | PE | Baidin, Misharev, et al., 1985 | Vertical value; LBLHLM |
8.65 | PE | Howell, Goncalves, et al., 1984 | Vertical value; LBLHLM |
8.74 ± 0.05 | PE | Nagy-Felsobuki and Peel, 1979 | Vertical value; LLK |
8.83 | PE | Bischof, Dewar, et al., 1974 | Vertical value; LLK |
Appearance energy determinations
Ion | AE (eV) | Other Products | Method | Reference | Comment |
---|---|---|---|---|---|
C9H11+ | 9.66 | CH3 | PI | Domnin, Lakshin, et al., 1985 | LBLHLM |
C9H11+ | 9.73 ± 0.02 | CH3 | PIPECO | Brand and Baer, 1983 | T = 298K; LBLHLM |
C9H11+ | 9.93 ± 0.03 | CH3 | PIPECO | Brand and Baer, 1983 | T = 0K; LBLHLM |
C9H11+ | 10.26 | CH3 | EI | Howe and Williams, 1969 | RDSH |

Kovats' RI, non-polar column, isothermal

Column type | Active phase | Temperature (C) | I | Reference | Comment |
---|---|---|---|---|---|
Packed | Squalane | 100. | 975. | Hongwei and Zhide, 1992 | H2, Silanized white support (80-100 mesh); Column length: 3. m |
Capillary | HP-1 | 60. | 975. | Zhang, Li, et al., 1992 | N2; Column length: 25. m; Column diameter: 0.20 mm |
Capillary | HP-1 | 60. | 975. | Zhang, Li, et al., 1992 | N2; Column length: 25. m; Column diameter: 0.20 mm |
Capillary | OV-1 | 100. | 986.9 | Engewald and Maurer, 1990 | Column length: 60. m; Column diameter: 0.32 mm |
Capillary | OV-1 | 120. | 992.5 | Engewald and Maurer, 1990 | Column length: 60. m; Column diameter: 0.32 mm |
Capillary | OV-1 | 90. | 980.9 | Maurer, Engewald, et al., 1990 | Column length: 50. m; Column diameter: 0.32 mm |
Capillary | OV-101 | 100. | 986. | Dimov and Mekenyan, 1989 | Column length: 50. m; Column diameter: 0.25 mm |
Capillary | OV-101 | 100. | 987. | Matisová, Kovacicová, et al., 1989 | He; Column length: 50. m; Column diameter: 0.20 mm |
Capillary | OV-101 | 145. | 1010. | Grinberg, Tokarev, et al., 1984 | He; Column length: 50. m; Column diameter: 0.25 mm |
Capillary | OV-101 | 145. | 1008. | Grinberg, Tokarev, et al., 1984 | He; Column length: 100. m; Column diameter: 0.25 mm |
Capillary | OV-101 | 100. | 986. | Boneva, Papazova, et al., 1983 | N2; Column length: 85. m; Column diameter: 0.28 mm |
Capillary | OV-101 | 100. | 988. | Boneva, Papazova, et al., 1983 | N2; Column length: 85. m; Column diameter: 0.28 mm |
Capillary | OV-101 | 100. | 986. | Boneva, Papazova, et al., 1983 | N2; Column length: 85. m; Column diameter: 0.28 mm |
Capillary | OV-101 | 110. | 987. | Boneva, Papazova, et al., 1983 | N2; Column length: 85. m; Column diameter: 0.28 mm |
Capillary | OV-101 | 90. | 982. | Boneva, Papazova, et al., 1983 | N2; Column length: 85. m; Column diameter: 0.28 mm |
Capillary | Squalane | 106. | 974. | Kugucheva and Mashinsky, 1983 | He; Column length: 100. m |
Capillary | Squalane | 96. | 971. | Kugucheva and Mashinsky, 1983 | He; Column length: 100. m |
Capillary | DB-1 | 60. | 974.9 | Lubeck and Sutton, 1983 | Column length: 60. m; Column diameter: 0.264 mm |
Capillary | DB-1 | 60. | 975.4 | Lubeck and Sutton, 1983 | 60. m/0.259 mm/1. μm |
Capillary | SE-30 | 70. | 980.0 | Tóth, 1983 | N2; Column length: 15. m; Column diameter: 0.25 mm |
Packed | SE-30 | 150. | 1008. | Winskowski, 1983 | Gaschrom Q; Column length: 2. m |
Capillary | OV-101 | 100. | 988. | Gerasimenko and Nabivach, 1982 | N2; Column length: 50. m; Column diameter: 0.30 mm |
Capillary | OV-101 | 120. | 994. | Gerasimenko and Nabivach, 1982 | N2; Column length: 50. m; Column diameter: 0.30 mm |
Capillary | OV-101 | 140. | 1001. | Gerasimenko and Nabivach, 1982 | N2; Column length: 50. m; Column diameter: 0.30 mm |
Capillary | Squalane | 86. | 969.9 | Macák, Nabivach, et al., 1982 | N2; Column length: 50. m; Column diameter: 0.25 mm |
Capillary | Squalane | 96. | 972.5 | Macák, Nabivach, et al., 1982 | N2; Column length: 50. m; Column diameter: 0.25 mm |
Capillary | OV-101 | 100. | 987.6 | Gerasimenko, Kirilenko, et al., 1981 | N2; Column length: 50. m; Column diameter: 0.3 mm |
Capillary | OV-101 | 120. | 993.5 | Gerasimenko, Kirilenko, et al., 1981 | N2; Column length: 50. m; Column diameter: 0.3 mm |
Capillary | OV-101 | 140. | 1000.9 | Gerasimenko, Kirilenko, et al., 1981 | N2; Column length: 50. m; Column diameter: 0.3 mm |
Packed | Squalane | 100. | 975. | Nabivach and Kirilenko, 1980 | He, Chromaton N-AW-HMDS; Column length: 1. m |
Capillary | Squalane | 86. | 969.9 | Nabivach and Kirilenko, 1979 | N2; Column length: 50. m |
Capillary | Squalane | 86. | 969.9 | Nabivach, Bur'yan, et al., 1978 | Column length: 50. m; Column diameter: 0.25 mm |
Capillary | Squalane | 96. | 972.5 | Nabivach, Bur'yan, et al., 1978 | Column length: 50. m; Column diameter: 0.25 mm |
Capillary | Squalane | 100. | 972. | Engewald and Wennrich, 1976 | N2; Column length: 100. m; Column diameter: 0.23 mm |
Capillary | Squalane | 80. | 967.08 | Soják and Rijks, 1976 | H2; Column length: 100. m; Column diameter: 0.25 mm |
Capillary | SE-30 | 65. | 975.4 | Svob and Deur-Siftar, 1974 | He; Column length: 25.5 m; Column diameter: 0.5 mm |
Capillary | Squalane | 100. | 973.3 | Svob and Deur-Siftar, 1974 | He; Column length: 10.5 m; Column diameter: 0.25 mm |

Kovats' RI, non-polar column, temperature ramp

Column type | Active phase | I | Reference | Comment |
---|---|---|---|---|
Capillary | OV-101 | 976. | Hayes and Pitzer, 1982 | 110. m/0.25 mm/0.20 μm, He, 1. K/min; Tstart: 35. C; Tend: 200. C |
Capillary | Apiezon L | 992. | Louis, 1971 | N2, 1. K/min; Column length: 50. m; Column diameter: 0.25 mm; Tstart: 60. C |

Kovats' RI, non-polar column, custom temperature program

Column type | Active phase | I | Reference | Comment |
---|---|---|---|---|
Capillary | Petrocol DH-100 | 983.22 | Haagen-Smit Laboratory, 1997 | He; Column length: 100. m; Column diameter: 0.2 mm; Program: 5C(10min) => 5C/min => 50C(48min) => 1.5C/min => 195C(91min) |

Kovats' RI, polar column, isothermal

Column type | Active phase | Temperature (C) | I | Reference | Comment |
---|---|---|---|---|---|
Capillary | PEG-20M | 70. | 1237.5 | Tóth, 1983 | N2; Column length: 30. m; Column diameter: 0.3 mm |
Capillary | Carbowax 20M | 100. | 1229.5 | Engewald and Wennrich, 1976 | N2; Column length: 100. m; Column diameter: 0.23 mm |
Capillary | Carbowax 20M | 90. | 1215.1 | Döring, Estel, et al., 1974 | Column length: 100. m; Column diameter: 0.2 mm |

Van Den Dool and Kratz RI, non-polar column, temperature ramp

Column type | Active phase | I | Reference | Comment |
---|---|---|---|---|
Capillary | PONA | 981. | Vendeuvre, Bertoncini, et al., 2005 | 50. m/0.2 mm/0.5 μm, 2. K/min; Tstart: 50. C |
Capillary | PONA | 988. | Vendeuvre, Bertoncini, et al., 2005 | 50. m/0.2 mm/0.5 μm, 5. K/min; Tstart: 50. C |
Capillary | DB-5 | 987.1 | Song, Lai, et al., 2003 | 30. m/0.25 mm/0.25 μm, He, 2. K/min; Tstart: 40. C; Tend: 310. C |
Capillary | DB-5 | 990.5 | Song, Lai, et al., 2003 | 30. m/0.25 mm/0.25 μm, He, 4. K/min; Tstart: 40. C; Tend: 310. C |
Capillary | DB-5 | 992.0 | Song, Lai, et al., 2003 | 30. m/0.25 mm/0.25 μm, He, 6. K/min; Tstart: 40. C; Tend: 310. C |
Capillary | DB-1 | 972.4 | Sun and Stremple, 2003 | 30. m/0.25 mm/0.25 μm, He, 3. K/min; Tstart: 40. C; Tend: 325. C |
Capillary | OV-101 | 979.3 | Yin, Liu, et al., 2001 | N2, 1. K/min; Column length: 80. m; Column diameter: 0.22 mm; Tstart: 30. C; Tend: 130. C |
Capillary | OV-1 | 979.1 | Gautzsch and Zinn, 1996 | 8. K/min; Tstart: 35. C; Tend: 300. C |
Capillary | DB-5 | 987.1 | Lai and Song, 1995 | 30. m/0.25 mm/0.25 μm, He, 2. K/min; Tstart: 40. C; Tend: 310. C |
Capillary | DB-5 | 990.5 | Lai and Song, 1995 | 30. m/0.25 mm/0.25 μm, He, 4. K/min; Tstart: 40. C; Tend: 310. C |
Capillary | DB-5 | 992. | Lai and Song, 1995 | 30. m/0.25 mm/0.25 μm, He, 6. K/min; Tstart: 40. C; Tend: 310. C |
Capillary | Petrocol DH | 978. | White, Hackett, et al., 1992 | 100. m/0.25 mm/0.5 μm, He, 1. K/min; Tstart: 30. C; Tend: 220. C |
Capillary | DB-5 | 988. | Morinaga, Hara, et al., 1990 | 15. m/0.53 mm/1.5 μm, He, 4. K/min; Tstart: 40. C; Tend: 90. C |
Capillary | Ultra-1 | 972.82 | Haynes and Pitzer, 1985 | 50. m/0.22 mm/0.33 μm, He, 1. K/min; Tstart: -30. C; Tend: 240. C |
Capillary | Ultra-1 | 976.53 | Haynes and Pitzer, 1985 | 50. m/0.22 mm/0.33 μm, He, 2. K/min; Tstart: -30. C; Tend: 240. C |
Capillary | Ultra-1 | 978.96 | Haynes and Pitzer, 1985 | 50. m/0.22 mm/0.33 μm, He, 3. K/min; Tstart: -30. C; Tend: 240. C |
Capillary | Ultra-2 | 989.31 | Haynes and Pitzer, 1985 | 50. m/0.22 mm/0.33 μm, He, 1. K/min; Tstart: -30. C; Tend: 240. C |
Capillary | Ultra-2 | 993.20 | Haynes and Pitzer, 1985 | 50. m/0.22 mm/0.33 μm, He, 2. K/min; Tstart: -30. C; Tend: 240. C |
Capillary | Ultra-2 | 995.68 | Haynes and Pitzer, 1985 | 50. m/0.22 mm/0.33 μm, He, 3. K/min; Tstart: -30. C; Tend: 240. C |
Capillary | OV-101 | 976. | Hayes and Pitzer, 1981 | 108. m/0.25 mm/0.2 μm, 1. K/min; Tstart: 35. C; Tend: 200. C |

Normal alkane RI, non-polar column, isothermal

Column type | Active phase | Temperature (C) | I | Reference | Comment |
---|---|---|---|---|---|
Capillary | Methyl Silicone | 120. | 1001. | Chen and Feng, 2006 | |
Capillary | Methyl Silicone | 120. | 988. | Chen and Feng, 2006 | |
Capillary | Squalane | 95.4 | 963. | Sojak and Vigdergauz, 1978 | H2 |
Capillary | Squalane | 110. | 976. | Papazova and Pankova, 1975 | N2; Column length: 100. m; Column diameter: 0.25 mm |
Packed | Polydimethyl siloxane | 110. | 994. | Ferrand, 1962 |

Normal alkane RI, non-polar column, temperature ramp

Column type | Active phase | I | Reference | Comment |
---|---|---|---|---|
Capillary | Polydimethyl siloxane: CP-Sil 5 CB | 977. | Bramston-Cook, 2013 | 60. m/0.25 mm/1.0 μm, Helium, 45. C @ 1.45 min, 3.6 K/min, 210. C @ 2.72 min |
Capillary | Petrocol DH | 984. | Supelco, 2012 | 100. m/0.25 mm/0.50 μm, Helium, 20. C @ 15. min, 15. K/min, 220. C @ 30. min |
Capillary | DB-1 | 984. | Zenkevich, Ukolov, et al., 2011 | 30. m/0.32 mm/0.25 μm, Nitrogen, 5. K/min; Tstart: 100. C; Tend: 200. C |
Capillary | OV-1 | 984. | Orav, Kailas, et al., 1999 | 2. K/min; Tstart: 50. C; Tend: 160. C |
Capillary | OV-101 | 975. | Orav, Kailas, et al., 1999, 2 | 50. m/0.20 mm/0.50 μm, Helium, 30. C @ 6. min, 1. K/min; Tend: 100. C |
Capillary | DB-1 | 994. | Ciccioli, Cecinato, et al., 1992 | 60. m/0.32 mm/1.2 μm, He, 30. C @ 10. min, 3. K/min; Tend: 240. C |
Capillary | OV-1 | 971. | Guan, Zheng, et al., 1992 | 50. m/0.32 mm/0.52 μm, H2, 1. K/min; Tstart: 30. C |
Capillary | OV-1 | 975. | Guan, Zheng, et al., 1992 | 50. m/0.32 mm/0.52 μm, H2, 2. K/min; Tstart: 35. C |
Capillary | CP Sil 5 CB | 975. | Hartgers, Damste, et al., 1992 | 25. m/0.32 mm/0.45 μm, He, 0. C @ 5. min, 3. K/min, 320. C @ 10. min |
Capillary | OV-101 | 980. | Zenkevich and Ventura, 1991 | Helium, 50. C @ 0. min, 5. K/min, 240. C @ 0. min; Column length: 54. m; Column diameter: 0.26 mm |
Capillary | SE-30 | 961. | Heydanek and McGorrin, 1981 | He, 40. C @ 3. min, 3. K/min; Column length: 50. m; Column diameter: 0.5 mm; Tend: 170. C |

Normal alkane RI, non-polar column, custom temperature program

Column type | Active phase | I | Reference | Comment |
---|---|---|---|---|
Capillary | SE-30 | 988. | Vinogradov, 2004 | Program: not specified |
Capillary | DB-1 | 973. | Ciccioli, Cecinato, et al., 1994 | 60. m/0.32 mm/0.25 μm; Program: not specified |
Capillary | OV-101 | 986. | Dimov, Osman, et al., 1994 | Program: not specified |
Capillary | DB-1 | 991. | Hathcock and Bertsch, 1993 | 100. m/0.25 mm/0.5 μm; Program: not specified |
Capillary | OV-1 | 986.4 | Engewald and Maurer, 1990 | Column length: 60. m; Column diameter: 0.32 mm; Program: 1) 1st 30m column temp ramp 4C/min 60-120C 2)2nd 30m column isothermal 100C |
Capillary | OV-1 | 993.8 | Engewald and Maurer, 1990 | Column length: 60. m; Column diameter: 0.32 mm; Program: 1) 1st 30m column temp ramp 4C/min 60-120C. 2) 2nd 30m column isothermal 120C. |
Capillary | OV-1 | 991.7 | Engewald and Maurer, 1990 | Column length: 60. m; Column diameter: 0.32 mm; Program: 1) 1st 30m column temp ramp 6C/min 60-120C. 2) 2nd 30m column isothermal 120C. |
Capillary | OV-1 | 991.9 | Engewald and Maurer, 1990 | Column length: 60. m; Column diameter: 0.32 mm; Program: 1)1st 30m column temp ramp 3C/min 60-120 2)2nd 30m column isothermal 120C |
Capillary | Squalane | 973.3 | Dimov and Mekenyan, 1989 | Program: not specified |
Capillary | OV-1, SE-30, Methyl silicone, SP-2100, OV-101, DB-1, etc. | 1008. | Waggott and Davies, 1984 | Hydrogen; Column length: 50. m; Column diameter: 0.32 mm; Program: not specified |
Capillary | Methyl Silicone | 985. | Bonchev, Mekenjan, et al., 1979 | Program: not specified |
Packed | SE-30 | 1000. | Robinson and Odell, 1971 | N2, Chromosorb W; Column length: 6.1 m; Program: 50C910min) => 20C/min => 90(6min) => 10C/min => 150C(hold) |
Packed | Squalane | 971. | Robinson and Odell, 1971 | N2, Embacel; Column length: 3.0 m; Program: 25C(5min) => 2C/min => 35 => 4C/min => 95C(hold) |

Normal alkane RI, polar column, isothermal

Column type | Active phase | Temperature (C) | I | Reference | Comment |
---|---|---|---|---|---|
Capillary | PEG-40M | 100. | 1249. | Nesterov, Nesterova, et al., 2000 | Column length: 50. m |
Capillary | PEG-40M | 100. | 1251. | Nesterov, Nesterova, et al., 2000 | Column length: 50. m |
Capillary | PEG-40M | 120. | 1262. | Nesterov, Nesterova, et al., 2000 | Column length: 50. m |
Capillary | PEG-40M | 140. | 1275. | Nesterov, Nesterova, et al., 2000 | Column length: 50. m |
Capillary | PEG-40M | 160. | 1287. | Nesterov, Nesterova, et al., 2000 | Column length: 50. m |
Capillary | PEG-40M | 60. | 1229. | Nesterov, Nesterova, et al., 2000 | Column length: 50. m |
Capillary | PEG-40M | 80. | 1239. | Nesterov, Nesterova, et al., 2000 | Column length: 50. m |
Capillary | Carbowax 20M | 90. | 1215. | Sutter, Peterson, et al., 1997 |

Normal alkane RI, polar column, custom temperature program

Column type | Active phase | I | Reference | Comment |
---|---|---|---|---|
Capillary | Carbowax 20M | 1247. | Vinogradov, 2004 | Program: not specified |
Capillary | Carbowax 20M | 1215. | Ivanciuc, Ivanciuc, et al., 2001 | Program: not specified |
Capillary | Carbowax 20M | 1223. | Dimov and Mekenyan, 1989 | Program: not specified |

Henry's Law data

Data compiled by: Rolf Sander
Henry's Law constant (water solution)
kH(T) = k°H exp(d(ln(kH))/d(1/T) ((1/T) - 1/(298.15 K)))
k°H = Henry's law constant for solubility in water at 298.15 K (mol/(kg*bar))
d(ln(kH))/d(1/T) = Temperature dependence constant (K)
k°H (mol/(kg*bar)) | d(ln(kH))/d(1/T) (K) | Method | Reference |
---|---|---|---|
0.084 | L | N/A | |
0.085 | V | N/A |

References

Prosen, Johnson, et al., 1946
Prosen, E.J.; Johnson, W.H.; Rossini, F.D.,
Heats of combustion and formation at 25°C of the alkylbenzenes through C10H14, and of the higher normal monoalkylbenzenes,
J. Res. NBS, 1946, 36, 455-461. [all data]
Richards and Davis, 1920
Richards, T.W.; Davis, H.S.,
The heats of combustion of benzene, toluene, aliphatic alcohols, cyclohexanol, and other carbon compounds,
J. Am. Chem. Soc., 1920, 42, 1599-1617. [all data]
Richards and Barry, 1915
Richards, T.W.; Barry, F.,
The heats of combustion of aromatic hydrocarbons and hexamethylene,
J. Am. Chem. Soc., 1915, 37, 993-1020. [all data]
Huffman, Parks, et al., 1930
Huffman, H.M.; Parks, G.S.; Daniels, A.C.,
Thermal data on organic compounds. VII. The heat capacities, entropies and free energies of twelve aromatic hydrocarbons,
J. Am. Chem. Soc., 1930, 52, 1547-1558. [all data]
Huffman, Parks, et al., 1930, 2
Huffman, H.M.; Parks, G.S.; Thomas, S.B.,
Thermal Data on Organic Compounds. VII The Heat Capacities, Entropies and Free Energies of the Isomeric Heptanes,
J. Am. Chem. Soc., 1930, 52, 3241. [all data]
Steele, Chirico, et al., 2002
Steele, W.V.; Chirico, R.D.; Knipmeyer, S.E.; Nguyen, A.,
Vapor Pressure, Heat Capacity, and Density along the Saturation Line: Measurements for Benzenamine, Butylbenzene, sec -Butylbenzene, tert -Butylbenzene, 2,2-Dimethylbutanoic Acid, Tridecafluoroheptanoic Acid, 2-Butyl-2-ethyl-1,3-propanediol, 2,2,4-Trimethyl-1,3-pentanediol, and 1-Chloro-2-propanol,
J. Chem. Eng. Data, 2002, 47, 4, 648-666, https://doi.org/10.1021/je010083e
. [all data]
Verevkin, 1998
Verevkin, Sergey P.,
Thermochemical properties of branched alkylsubstituted benzenes,
The Journal of Chemical Thermodynamics, 1998, 30, 8, 1029-1040, https://doi.org/10.1006/jcht.1998.0370
. [all data]
Stephenson and Malanowski, 1987
Stephenson, Richard M.; Malanowski, Stanislaw,
Handbook of the Thermodynamics of Organic Compounds, 1987, https://doi.org/10.1007/978-94-009-3173-2
. [all data]
Forziati, Norris, et al., 1949
Forziati, Alphonse F.; Norris, William R.; Rossini, Frederick D.,
Vapor pressures and boiling points of sixty API-NBS hydrocarbons,
J. RES. NATL. BUR. STAN., 1949, 43, 6, 555-17, https://doi.org/10.6028/jres.043.050
. [all data]
Forziati, Norris, et al., 1949, 2
Forziati, A.F.; Norris, W.R.; Rossini, F.D.,
Vapor Pressures and Boiling Points of Sixty API-NBS Hydrocarbons,
J. Res. Natl. Bur. Stand. (U.S.), 1949, 43, 6, 555-563, https://doi.org/10.6028/jres.043.050
. [all data]
Chirico and Steele, 2009
Chirico, Robert D.; Steele, William V.,
Thermodynamic properties of tert-butylbenzene and 1,4-di-tert-butylbenzene,
The Journal of Chemical Thermodynamics, 2009, 41, 3, 392-401, https://doi.org/10.1016/j.jct.2008.10.008
. [all data]
Domalski and Hearing, 1996
Domalski, Eugene S.; Hearing, Elizabeth D.,
Heat Capacities and Entropies of Organic Compounds in the Condensed Phase. Volume III,
J. Phys. Chem. Ref. Data, 1996, 25, 1, 1, https://doi.org/10.1063/1.555985
. [all data]
Nesterova, Verevkin, et al., 1984
Nesterova, T.N.; Verevkin, S.R.; Karaseva, S.Ya.; Rozhnov, A.M.; Tsvetkov, V.F.,
The equilibria in the interconversions of t-butylbenzenes,
Russ. J. Phys. Chem. (Engl. Transl.), 1984, 58, 297-298. [all data]
Domnin, Lakshin, et al., 1985
Domnin, I.N.; Lakshin, A.M.; Misharev, A.D.; Orlov, V.M.; Takhistov, V.V.,
Thermochemical investigation of some hydrocarbon ions generated by photoionization,
J. Org. Chem. USSR, 1985, 21, 1149. [all data]
Baidin, Misharev, et al., 1985
Baidin, V.N.; Misharev, A.D.; Takhistov, V.V.,
Effect of alkyl substituents on the ionization potentials of halogenobenzenes,
Zh. Org. Khim., 1985, 21, 817. [all data]
VanderGreef, 1980
VanderGreef, J.,
[Title unavailable], Thesis, Amsterdam, 1980. [all data]
McLoughlin, Morrison, et al., 1979
McLoughlin, R.G.; Morrison, J.D.; Traeger, J.C.,
Photoionization of the C-1 - C-4 monosubstituted alkyl benzenes: Thermochemistry of [C7H7]+ and [C8H9]+ formation,
Org. Mass Spectrom., 1979, 14, 104. [all data]
Lias and Ausloos, 1978
Lias, S.G.; Ausloos, P.J.,
eIonization energies of organic compounds by equilibrium measurements,
J. Am. Chem. Soc., 1978, 100, 6027. [all data]
Pitt, 1973
Pitt, C.G.,
Hyperconjugation and its role in group IV chemistry,
J. Organomet. Chem., 1973, 61, 49. [all data]
Watanabe, Nakayama, et al., 1962
Watanabe, K.; Nakayama, T.; Mottl, J.,
Ionization potentials of some molecules,
J. Quant. Spectry. Radiative Transfer, 1962, 2, 369. [all data]
Price, Bralsford, et al., 1959
Price, W.C.; Bralsford, R.; Harris, P.V.; Ridley, R.G.,
Ultra-violet spectra and ionization potentials of hydrocarbon molecules,
Spectrochim. Acta, 1959, 14, 45. [all data]
Howell, Goncalves, et al., 1984
Howell, J.O.; Goncalves, J.M.; Amatore, C.; Klasinc, L.; Wightman, R.M.; Kochi, J.K.,
Electron transfer from aromatic hydrocarbons and their π-complexes with metals. Comparison of the standard oxidation potentials and vertical ionization potentials,
J. Am. Chem. Soc., 1984, 106, 3968. [all data]
Nagy-Felsobuki and Peel, 1979
Nagy-Felsobuki, E.; Peel, J.B.,
Photoelectron spectroscopic studies of the butylbenzenes,
J. Electron Spectrosc. Relat. Phenom., 1979, 16, 397. [all data]
Bischof, Dewar, et al., 1974
Bischof, P.K.; Dewar, M.J.S.; Goodman, D.W.; Jones, T.B.,
Photoelectron spectra of molecules. VI. Hyperconjugation versus pπ-dπ bonding in group IVb compounds,
J. Organomet. Chem., 1974, 82, 89. [all data]
Brand and Baer, 1983
Brand, W.A.; Baer, T.,
Unimolecular dissociation of energy-selected t-butylbenzene ions and effect of thermal energy on data analysis,
Int. J. Mass Spectrom. Ion Phys., 1983, 49, 103. [all data]
Howe and Williams, 1969
Howe, I.; Williams, D.H.,
Calculation and qualitative predictions of mass spectra. Mono- and paradisubstituted benzenes,
J. Am. Chem. Soc., 1969, 91, 7137. [all data]
Hongwei and Zhide, 1992
Hongwei, Z.; Zhide, H.,
Utilization of total solubility parameter for calculating retention indices of alkylbenzenes,
Chromatographia, 1992, 33, 11/12, 575-580, https://doi.org/10.1007/BF02262251
. [all data]
Zhang, Li, et al., 1992
Zhang, M.J.; Li, S.D.; Chen, B.J.,
Compositional studies of high-temperature coal tar by GC/FTIR analysis of light oil fractions,
Chromatographia, 1992, 33, 3/4, 138-146, https://doi.org/10.1007/BF02275894
. [all data]
Engewald and Maurer, 1990
Engewald, W.; Maurer, T.,
Enhanced possibilities for identification by the use of series-coupled capillary gas chromatographic columns. I. General exposition and application of the retention index concept,
J. Chromatogr., 1990, 520, 3-13, https://doi.org/10.1016/0021-9673(90)85078-A
. [all data]
Maurer, Engewald, et al., 1990
Maurer, T.; Engewald, W.; Steinborn, A.,
Enhanced possibilities for identification using series-coupled capillary gas chromatographic columns. II. Retention indices as an identification tool in selectivity tuning,
J. Chromatogr., 1990, 517, 77-86, https://doi.org/10.1016/S0021-9673(01)95711-5
. [all data]
Dimov and Mekenyan, 1989
Dimov, N.; Mekenyan, Ov.,
Quantitative Relationships Between the Structure of Alkylbenzenes and Their Gas Chromatographic Retention on Stationary Phasses with Different Polarity,
J. Chromatogr., 1989, 471, 227-236, https://doi.org/10.1016/S0021-9673(00)94170-0
. [all data]
Matisová, Kovacicová, et al., 1989
Matisová, E.; Kovacicová, E.; Ha, P.T.; Kolek, E.; Engewald, W.,
Identification of alkylbenzenes up to C12 by capillary gas chromatography-mass spectrometry. II. Retention indices on OV-101 columns and retention-molecular structure correlations,
J. Chromatogr., 1989, 475, 2, 113-123, https://doi.org/10.1016/S0021-9673(01)89667-9
. [all data]
Grinberg, Tokarev, et al., 1984
Grinberg, A.A.; Tokarev, M.I.; Bigdash, T.V.; Kogan, L.O.; Leont'eva, S.A.,
Special features of using Kovats retention indices in chromatomass spectrometric analysis,
Zh. Anal. Khim., 1984, 39, 6, 909-911. [all data]
Boneva, Papazova, et al., 1983
Boneva, St.; Papazova, D.; Dimov, N.,
Retention Indices of aromatic hydrocarbons on glass and metal capillary columns with stationary phase OV-101,
Jahrb. Chem. Tech. Hochschule Burgas, 1983, 18, 143-148. [all data]
Kugucheva and Mashinsky, 1983
Kugucheva, E.E.; Mashinsky, V.I.,
Retention Indices of Aromatic Hydrocarbons on Capillary Columns with Squalan and Polyphenyl Ether,
Zh. Anal. Khim. (Rus), 1983, 38, 11, 2023-2026. [all data]
Lubeck and Sutton, 1983
Lubeck, A.J.; Sutton, DL.,
Kovats retention indices of selected hydrocarbons through C10 on bonded phase fused silica capillaries,
J. Hi. Res. Chromatogr. Chromatogr. Comm., 1983, 6, 6, 328-332, https://doi.org/10.1002/jhrc.1240060612
. [all data]
Tóth, 1983
Tóth, T.,
Use of capillary gas chromatography in collecting retention and chemical information for the analysis of complex petrochemical mixtures,
J. Chromatogr., 1983, 279, 157-165, https://doi.org/10.1016/S0021-9673(01)93614-3
. [all data]
Winskowski, 1983
Winskowski, J.,
Gaschromatographische Identifizierung von Stoffen anhand von Indexziffem und unterschiedlichen Detektoren,
Chromatographia, 1983, 17, 3, 160-165, https://doi.org/10.1007/BF02271041
. [all data]
Gerasimenko and Nabivach, 1982
Gerasimenko, V.A.; Nabivach, V.M.,
Relationship between molecular structure and gas chromatographic retention of alkylbenzenes C8-C1 2 on polydimethylsiloxane,
Zh. Anal. Khim., 1982, 37, 110-116. [all data]
Macák, Nabivach, et al., 1982
Macák, J.; Nabivach, V.; Buryan, P.; Sindler, S.,
Dependence of retention indices of alkylbenzenes on their molecular structure,
J. Chromatogr., 1982, 234, 2, 285-302, https://doi.org/10.1016/S0021-9673(00)81867-1
. [all data]
Gerasimenko, Kirilenko, et al., 1981
Gerasimenko, V.A.; Kirilenko, A.V.; Nabivach, V.M.,
Capillary gas chromatography of aromatic compounds found in coal tar fractions,
J. Chromatogr., 1981, 208, 1, 9-16, https://doi.org/10.1016/S0021-9673(00)87953-4
. [all data]
Nabivach and Kirilenko, 1980
Nabivach, V.M.; Kirilenko, A.V.,
Relationship between the gas chromatographic behaviour and the molecular structure of hydrocarbon samples and various stationary phases. Part II. Correlation between the retention index, physicochemical properties and molecular structure,
Chromatographia, 1980, 13, 2, 93-100, https://doi.org/10.1007/BF02263060
. [all data]
Nabivach and Kirilenko, 1979
Nabivach, V.M.; Kirilenko, A.V.,
The use of retention indices for identifying the components of crude benzene,
Solid Fuel Chem. (Engl. Transl.), 1979, 13, 3, 82-87. [all data]
Nabivach, Bur'yan, et al., 1978
Nabivach, V.M.; Bur'yan, P.; Matsak, I.,
Retention indices of aromatic hydrocarbons on a squalane capillary column,
Zh. Anal. Khim., 1978, 33, 7, 1108-1113. [all data]
Engewald and Wennrich, 1976
Engewald, W.; Wennrich, L.,
Molekülstruktur und Retentionsverhalten. VIII. Zum Retentionsverhalten höherer Alkylbenzole bei der Gas-Verteilungs-Chromatographie,
Chromatographia, 1976, 9, 11, 540-547, https://doi.org/10.1007/BF02275960
. [all data]
Soják and Rijks, 1976
Soják, L.; Rijks, J.A.,
Capillary gas chromatography of alkylbenzenes. I. Some problems encountered with the precision of the retention indcies of alkylbenzenes,
J. Chromatogr., 1976, 119, 505-521, https://doi.org/10.1016/S0021-9673(00)86812-0
. [all data]
Svob and Deur-Siftar, 1974
Svob, V.; Deur-Siftar, D.,
Kovats Retention Indices in the Identification of Alkylbenzene Degradation Products,
J. Chromatogr., 1974, 91, 677-689, https://doi.org/10.1016/S0021-9673(01)97947-6
. [all data]
Hayes and Pitzer, 1982
Hayes, P.C., Jr.; Pitzer, E.W.,
Characterizing petroleum- and shale-derived jet fuel distillates via temperature-programmed Kováts indices,
J. Chromatogr., 1982, 253, 179-198, https://doi.org/10.1016/S0021-9673(01)88376-X
. [all data]
Louis, 1971
Louis, R.,
Kovats-index-tafeln zur gaschromatographischen analyse von kohlenwasserstoffgemischen,
Erdoel Kohle Erdgas Petrochem., 1971, 24, 2, 88-94. [all data]
Haagen-Smit Laboratory, 1997
Haagen-Smit Laboratory,
Procedure for the detailed hydrocarbon analysis of gasolines by single column high efficiency (capillary) column gas chromatography, SOP NO. MLD 118, Revision No. 1.1, California Environmental Protection Agency, Air Resources Board, El Monte, California, 1997, 22. [all data]
Döring, Estel, et al., 1974
Döring, C.E.; Estel, D.; Fischer, R.,
Kapillar-gaschromatographische Charakterisierung von C10-bis C12-Aromaten,
J. Prakt. Chem., 1974, 316, 1, 1-12, https://doi.org/10.1002/prac.19743160102
. [all data]
Vendeuvre, Bertoncini, et al., 2005
Vendeuvre, C.; Bertoncini, F.; Thiébaut, D.; Martin, M.; Hennion, M.-C.,
Evluation of a retention model in comprehensive two-dimensional gas chromatography,
J. Sep. Sci., 2005, 28, 11, 1129-1136, https://doi.org/10.1002/jssc.200401933
. [all data]
Song, Lai, et al., 2003
Song, C.; Lai, W.-C.; Madhusudan Reddy, K.; Wei, B.,
Chapter 7. Temperature-programmed retention indices for GC and GC-MS of hydrocarbon fuels and simulated distillation GC of heavy oils
in Analytical advances for hydrocarbon research, Hsu,C.S., ed(s)., Kluwer Academic/Plenum Publishers, New York, 2003, 147-193. [all data]
Sun and Stremple, 2003
Sun, G.; Stremple, P.,
Retention index characterization of flavor, fragrance, and many other compounds on DB-1 and DB-XLB, 2003, retrieved from http://www.chem.agilent.com/cag/cabu/pdf/b-0279.pdf. [all data]
Yin, Liu, et al., 2001
Yin, C.; Liu, W.; Li, Z.; Pan, Z.; Lin, T.; Zhang, M.,
Chemometrics to chemical modeling: structural coding in hydrocarbons and retention indices of gas chromatography,
J. Sep. Sci., 2001, 24, 3, 213-220, https://doi.org/10.1002/1615-9314(20010301)24:3<213::AID-JSSC213>3.0.CO;2-4
. [all data]
Gautzsch and Zinn, 1996
Gautzsch, R.; Zinn, P.,
Use of incremental models to estimate the retention indexes of aromatic compounds,
Chromatographia, 1996, 43, 3/4, 163-176, https://doi.org/10.1007/BF02292946
. [all data]
Lai and Song, 1995
Lai, W.-C.; Song, C.,
Temperature-programmed retention indices for g.c. and g.c.-m.s. analysis of coal- and petroleum-derived liquid fuels,
Fuel, 1995, 74, 10, 1436-1451, https://doi.org/10.1016/0016-2361(95)00108-H
. [all data]
White, Hackett, et al., 1992
White, C.M.; Hackett, J.; Anderson, R.R.; Kail, S.; Spock, P.S.,
Linear temperature programmed retention indices of gasoline range hydrocarbons and chlorinated hydrocarbons on cross-linked polydimethylsiloxane,
J. Hi. Res. Chromatogr., 1992, 15, 2, 105-120, https://doi.org/10.1002/jhrc.1240150211
. [all data]
Morinaga, Hara, et al., 1990
Morinaga, M.; Hara, K.; Kageura, M.; Heida, Y.; Takamoto, M.; Kashimura, S.,
A simple, rapid and simultaneous analysis of complex volatile hydrocarbon mixtures in blood using gas chromatography/mass spectrometry with a wide-bore capillary column,
Z. Rechtsmed., 1990, 103, 8, 567-572, https://doi.org/10.1007/BF01261420
. [all data]
Haynes and Pitzer, 1985
Haynes, P.C., Jr.; Pitzer, E.W.,
Disengaging solutes in shale- and petroleum-derived jet fuels by altering GC programmed temperature rates,
J. Hi. Res. Chromatogr. Chromatogr. Comm., 1985, 8, 5, 230-242, https://doi.org/10.1002/jhrc.1240080504
. [all data]
Hayes and Pitzer, 1981
Hayes, P.C., Jr.; Pitzer, E.W.,
Kovats indices as a tool in characterizing hydrocarbon fuels in temperature programmed glass capillary gas chromatography. Part 1. Qualitative identification, Inhouse rpt. for Air Force Wright Aeronautical Labs., Air Force Wright Aeronautical Labs., Wright-Patterson AFB, Ohio, 1981, 75. [all data]
Chen and Feng, 2006
Chen, Y.; Feng, C.-I.,
Regerating the spent metal-contaminated cracking catalyst by ozalic acid,
J. Shanxi Univ. (Nat. Sci. Ed.), 2006, 29, 4, 414-420. [all data]
Sojak and Vigdergauz, 1978
Sojak, L.; Vigdergauz, M.S.,
Comparison of interpolation methods for the interpretation of retention data in gas chromatography,
J. Chromatogr., 1978, 148, 1, 159-167, https://doi.org/10.1016/S0021-9673(00)99332-4
. [all data]
Papazova and Pankova, 1975
Papazova, D.I.; Pankova, M.C.,
Identification of individual aromatic hydrocarbons in kerosene fraction (b.p. 150-250 °),
J. Chromatogr., 1975, 105, 2, 411-414, https://doi.org/10.1016/S0021-9673(01)82276-7
. [all data]
Ferrand, 1962
Ferrand, R.,
Gas phase chromatography using retention indices for the analysis of tars and their hydrogenation products,
Journees internationales d'etude des methodes de separation immediate at de chromatographie; Org. sur l'initiative du IX., 1962, 132-140. [all data]
Bramston-Cook, 2013
Bramston-Cook, R.,
Kovats indices for C2-C13 hydrocarbons and selected oxygenated/halocarbons with 100 % dimethylpolysiloxane columns, 2013, retrieved from http://lotusinstruments.com/monographs/List .... [all data]
Supelco, 2012
Supelco, CatalogNo. 24160-U,
Petrocol DH Columns. Catalog No. 24160-U, 2012, retrieved from http://www.sigmaaldrich.com/etc/medialib/docs/Supelco/Datasheet/1/w97949.Par.0001.File.tmp/w97949.pdf. [all data]
Zenkevich, Ukolov, et al., 2011
Zenkevich, I.G.; Ukolov, A.I.; Kushakova, A.S.; Gustyleva, L.K.,
Identification of isomeric alkylarenes with the use of additive relations for the evaluation of gas-chromatographic retention indices,
Rus. J. Anal. Chem., 2011, 66, 12, 1165-1172, https://doi.org/10.1134/S1061934811120136
. [all data]
Orav, Kailas, et al., 1999
Orav, A.; Kailas, T.; Muurisepp, M.; Kann, J.,
Composition of the oil from waste tires. 2. Fraction boiling at 160-180 0C,
Proc. Estonian Acad. Sci. Chem., 1999, 48, 3, 136-140. [all data]
Orav, Kailas, et al., 1999, 2
Orav, A.; Kailas, T.; Muurisepp, M.; Kann, J.,
Composition of the oil from waste tires. 1. Fraction boiling at yp to 160 0C,
Proc. Estonian Acad. Sci. Chem., 1999, 48, 1, 30-39. [all data]
Ciccioli, Cecinato, et al., 1992
Ciccioli, P.; Cecinato, A.; Brancaleoni, E.; Frattoni, M.; Liberti, A.,
Use of carbon adsorption traps combined with high resolution gas chromatography - mass spectrometry for the analysis of polar and non-polar C4-C14 hydrocarbons involved in photochemical smog formation,
J. Hi. Res. Chromatogr., 1992, 15, 2, 75-84, https://doi.org/10.1002/jhrc.1240150205
. [all data]
Guan, Zheng, et al., 1992
Guan, Y.; Zheng, P.; Zhou, L.,
Prediction, optimization of separation, and identification of unknown compounds in capillary gas chromatography,
J. Hi. Res. Chromatogr., 1992, 15, 1, 18-23, https://doi.org/10.1002/jhrc.1240150106
. [all data]
Hartgers, Damste, et al., 1992
Hartgers, W.A.; Damste, J.S.S.; de Leeuw, J.W.,
Identification of C2-C4 alkylated benzenes in flash pyrolysates of kerogens, coals and asphaltenes,
J. Chromatogr., 1992, 606, 2, 211-220, https://doi.org/10.1016/0021-9673(92)87027-6
. [all data]
Zenkevich and Ventura, 1991
Zenkevich, I.G.; Ventura, K.,
Gas Chromatographic Identification of Volatile Products of Thermal Degradation of Bitumen,
Zh. Prikl. Khim. (Rus.), 1991, 9, 1974-1979. [all data]
Heydanek and McGorrin, 1981
Heydanek, M.G.; McGorrin, R.J.,
Gas chromatography-mass spectroscopy investigations on the flavor chemistry of oat groats,
J. Agric. Food Chem., 1981, 29, 5, 950-954, https://doi.org/10.1021/jf00107a016
. [all data]
Vinogradov, 2004
Vinogradov, B.A.,
Production, composition, properties and application of essential oils, 2004, retrieved from http://viness.narod.ru. [all data]
Ciccioli, Cecinato, et al., 1994
Ciccioli, P.; Cecinato, A.; Brancaleoni, E.; Brachetti, A.; Frattoni, M.; Sparapani, R.,
Composition and Distribution of Polar and Non-Polar VOCs in Urban, Rural, Forest and Remote Areas,
Eur Commission EUR, 1994, 549-568. [all data]
Dimov, Osman, et al., 1994
Dimov, N.; Osman, A.; Mekenyan, Ov.; Papazova, D.,
Selection of moelcular descriptors used in quantitative structure-gas chromatographic retention relationships. I. Application to alkylbenzenes and naphthalenes,
Anal. Chim. Acta., 1994, 298, 3, 303-317, https://doi.org/10.1016/0003-2670(94)00280-0
. [all data]
Hathcock and Bertsch, 1993
Hathcock, S.; Bertsch, W.,
Analysis of volatiles associated with industrial scale processing of expanded polystyrene. Part II: Identification and quantitation,
J. Hi. Res. Chromatogr., 1993, 16, 11, 651-659, https://doi.org/10.1002/jhrc.1240161106
. [all data]
Waggott and Davies, 1984
Waggott, A.; Davies, I.W.,
Identification of organic pollutants using linear temperature programmed retention indices (LTPRIs) - Part II, 1984, retrieved from http://dwi.defra.gov.uk/research/completed-research/reports/dwi0383.pdf. [all data]
Bonchev, Mekenjan, et al., 1979
Bonchev, D.; Mekenjan, Ov.; Protic, G.; Trinajstic, N.,
Application of Topological Indices to Gas Chromatographic Data: Calculation of the Retention Indices of Isomeric Alkylbenzenes,
J. Chromatogr., 1979, 176, 2, 149-156, https://doi.org/10.1016/S0021-9673(00)85645-9
. [all data]
Robinson and Odell, 1971
Robinson, P.G.; Odell, A.L.,
A system of standard retention indices and its uses. The characterisation of stationary phases and the prediction of retention indices,
J. Chromatogr., 1971, 57, 1-10, https://doi.org/10.1016/0021-9673(71)80001-8
. [all data]
Nesterov, Nesterova, et al., 2000
Nesterov, I.A.; Nesterova, T.N.; Pimerzin, A.A.; Tsvetkov, V.S.,
Thermodynamics of alkylbenzene sorption and evaporation. IV. Enthalpies of evaporation and thermodynamics chracteristics of sorption by stationary phases OV-101 and PEG-40M,
Izvestia vysshikh uchebnykh zavedenii. Khimia i khimicheskaia tekhnologia (Chemistry and chemical technology), 2000, 43, 4, 39-45. [all data]
Sutter, Peterson, et al., 1997
Sutter, J.M.; Peterson, T.A.; Jurs, P.C.,
Prediction of gas chromatographic retention indices of alkylbenzenes,
Anal. Chim. Acta., 1997, 342, 2-3, 113-122, https://doi.org/10.1016/S0003-2670(96)00578-8
. [all data]
Ivanciuc, Ivanciuc, et al., 2001
Ivanciuc, O.; Ivanciuc, T.; Klein, D.J.; Seitz, W.A.; Balaban, A.T.,
Quantitative structure-retention relationships for gas chromatographic retention indices of alkylbenzenes with molecular graph descriptors,
SAR QSAR Environ. Res., 2001, 11, 5-6, 419-452, https://doi.org/10.1080/10629360108035362
. [all data]