Butanal, 2-ethyl-
- Formula: C6H12O
- Molecular weight: 100.1589
- IUPAC Standard InChIKey: UNNGUFMVYQJGTD-UHFFFAOYSA-N
- CAS Registry Number: 97-96-1
- Chemical structure:
View 3d structure (requires JavaScript / HTML 5) - Other names: Butyraldehyde, 2-ethyl-; α-Ethylbutyraldehyde; Diethylacetaldehyde; 2-Ethylbutanal; 2-Ethylbutyraldehyde; 2-Ethylbutyric aldehyde; 3-Formylpentane; (C2H5)2CHCHO; Aldehyde 2-ethylbutyrique; 2-Ethylbutyric aledhyde; UN 1178; NSC 6757; α-Ethylbutanal

Phase change data

Data compiled as indicated in comments:
BS - Robert L. Brown and Stephen E. Stein
TRC - Thermodynamics Research Center, NIST Boulder Laboratories, Chris Muzny director
Quantity | Value | Units | Method | Reference | Comment |
---|---|---|---|---|---|
Tboil | 390. ± 2. | K | AVG | N/A | Average of 8 values; Individual data points |
Quantity | Value | Units | Method | Reference | Comment |
Tfus | 184. | K | N/A | Anonymous, 1958 | Uncertainty assigned by TRC = 4. K; TRC |
Tfus | 184. | K | N/A | Anonymous, 1953 | Uncertainty assigned by TRC = 5. K; TRC |

Gas phase ion energetics data

Data compiled as indicated in comments:
LLK - Sharon G. Lias, Rhoda D. Levin, and Sherif A. Kafafi
B - John E. Bartmess
Electron affinity determinations
EA (eV) | Reference | Comment |
---|---|---|
0.001519 ± 0.000087 | Hammer, Diri, et al., 2003 | B |
Ionization energy determinations
IE (eV) | Method | Reference | Comment |
---|---|---|---|
9.54 | EI | Holmes, Fingas, et al., 1981 | LLK |
Appearance energy determinations
Ion | AE (eV) | Other Products | Method | Reference | Comment |
---|---|---|---|---|---|
C4H8O+ | 9.68 | C2H4 | EI | Holmes and Lossing, 1980 | LLK |

Van Den Dool and Kratz RI, polar column, custom temperature program

Data compiled by: NIST Mass Spectrometry Data Center, William E. Wallace, director

Column type CapillaryCapillary
Active phase Supelcowax-10Supelcowax-10
Column length (m) 30.30.
Carrier gas HeHe
Substrate
Column diameter (mm) 0.250.25
Phase thickness (μm) 0.250.25
Program 35C(8min) => 4C/min => 60C => 6C/min => 160C => 20C/min => 200C(1min)40C(1min) => 10C/min => 120C => 15C/min => 200C (1min)
I 1004.1007.
ReferenceBianchi, Careri, et al., 2007Bianchi, Careri, et al., 2007
Comment MSDC-RI MSDC-RI

References

Anonymous, 1958
Anonymous, R.,
, Am. Pet. Inst. Res. Proj. 45, Ohio State Univ., 1958. [all data]
Anonymous, 1953
Anonymous, R.,
, Physical Properties of Chemical Substances, Dow Chemical Company, 1953. [all data]
Hammer, Diri, et al., 2003
Hammer, N.I.; Diri, K.; Jordan, K.D.; Desfrancois, C.; Compton, R.N.,
Dipole-bound anions of carbonyl, nitrile, and sulfoxide containing molecules,
J. Chem. Phys., 2003, 119, 7, 3650-3660, https://doi.org/10.1063/1.1590959
. [all data]
Holmes, Fingas, et al., 1981
Holmes, J.L.; Fingas, M.; Lossing, F.P.,
Towards a general scheme for estimating the heats of formation of organic ions in the gas phase. Part I. Odd-electron cations,
Can. J. Chem., 1981, 59, 80. [all data]
Holmes and Lossing, 1980
Holmes, J.L.; Lossing, F.P.,
Gas-phase heats of formation of keto and enol ions of carbonyl compounds.,
J. Am. Chem. Soc., 1980, 102, 1591. [all data]