L-Alanine, N-acetyl-
- Formula: C5H9NO3
- Molecular weight: 131.1299
- IUPAC Standard InChIKey: KTHDTJVBEPMMGL-GSVOUGTGSA-N
- CAS Registry Number: 97-69-8
- Chemical structure:
View 3d structure (requires JavaScript / HTML 5) - Other names: Alanine, N-acetyl-, L-; Acetylalanine; N-Acetyl-L-alanine; N-Acetyl-S-alanine; N-Acetylalanine; CH3CONHCH(CH3)COOH; N-Acetyl-L-α-alanine; 2-acetamidopropionic acid

Reaction thermochemistry data

Data compiled by: Robert C. Dunbar
Individual Reactions
By formula: Na+ + C5H9NO3 = (Na+ • C5H9NO3)
Free energy of reaction
ΔrG° (kJ/mol) | T (K) | Method | Reference |
---|---|---|---|
134. | 0. | CIDC | Feng, Gronert, et al., 1999 |

Gas phase ion energetics data

Data compiled by: Sharon G. Lias, John E. Bartmess, Joel F. Liebman, John L. Holmes, Rhoda D. Levin, and W. Gary Mallard
Ionization energy determinations
IE (eV) | Method | Reference | Comment |
---|---|---|---|
9.2 | PE | Cannington and Ham, 1983 | |
9.65 | PE | Cannington and Ham, 1983 | Vertical value |

Ion clustering data

Data compiled by: Robert C. Dunbar
Clustering reactions
By formula: Na+ + C5H9NO3 = (Na+ • C5H9NO3)
Free energy of reaction
ΔrG° (kJ/mol) | T (K) | Method | Reference |
---|---|---|---|
134. | 0. | CIDC | Feng, Gronert, et al., 1999 |

References

Feng, Gronert, et al., 1999
Feng, W.Y.; Gronert, S.; Lebrilla, C.B.,
Lithium and sodium ion binding energies of N-acetyl and N-glycyl amino acids,
J. Am. Chem. Soc., 1999, 121, 6, 1365, https://doi.org/10.1021/ja983116s
. [all data]
Cannington and Ham, 1983
Cannington, P.H.; Ham, N.S.,
He(I) and He(II) photoelectron spectra of glycine and related molecules,
J. Electron Spectrosc. Relat. Phenom., 1983, 32, 139. [all data]