Cyclo-tris(bis(dimethylamino))phosphonitrile

Gas phase ion energetics data

Data compiled as indicated in comments:
LLK - Sharon G. Lias, Rhoda D. Levin, and Sherif A. Kafafi
RDSH - Henry M. Rosenstock, Keith Draxl, Bruce W. Steiner, and John T. Herron

Ionization energy determinations

IE (eV) Method Reference Comment
7.62EIClare and Sowerby, 1981LLK
7.85 ± 0.05EIBranton, Brion, et al., 1970RDSH

References

Clare and Sowerby, 1981
Clare, P.; Sowerby, D.B., Electron impact ionisation energies of some halo-cyclotriphosphazenes, J. Inorg. Nucl. Chem., 1981, 43, 477. [all data]

Branton, Brion, et al., 1970
Branton, G.R.; Brion, C.E.; Frost, D.C.; Mitchell, K.A.R.; Paddock, N.L., Phosphonitrilic derivatives. Part XVIII.lonisation potentials, orbital symmetry, and π-electron interactions, J. Chem. Soc., 1970, (A), 151. [all data]