CF2Br2-

Vibrational and/or electronic energy levels

Data compiled by: Marilyn E. Jacox

State:   X

Vib.
sym.
 No.   Approximate
 type of mode
 cm-1   Med.   Method   References

1001 s T Ar IR Prochaska and Andrews, 1978
554 vs T Ar IR Prochaska and Andrews, 1978

Additional references: Jacox, 1994, page 303

References

Prochaska and Andrews, 1978
Prochaska, F.T.; Andrews, L., Matrix photoionization and radiolysis of the fluorobromomethanes. Infrared spectra and photochemistry of dibromofluoromethyl(1+), bromodifluoromethyl(1+), trifluoromethyl(1+), and the parent cations, J. Phys. Chem., 1978, 82, 15, 1731, https://doi.org/10.1021/j100504a015 . [all data]

Jacox, 1994
Jacox, M.E., Vibrational and electronic energy levels of polyatomic transient molecules, American Chemical Society, Washington, DC, 1994, 464. [all data]