1H-Pyrrole, 1-methyl-
- Formula: C5H7N
- Molecular weight: 81.1158
- IUPAC Standard InChIKey: OXHNLMTVIGZXSG-UHFFFAOYSA-N
- CAS Registry Number: 96-54-8
- Chemical structure:
View 3d structure (requires JavaScript / HTML 5) - Other names: Pyrrole, 1-methyl-; N-Methylpyrrole; 1-Methylpyrrole; 1-Methyl-1H-pyrrole; N-Methylpyrrol; 1-Methylpyrrol

Gas phase thermochemistry data

Data compiled by: Hussein Y. Afeefy, Joel F. Liebman, and Stephen E. Stein
Quantity | Value | Units | Method | Reference | Comment |
---|---|---|---|---|---|
ΔfH°gas | 24.65 ± 0.13 | kcal/mol | Ccb | Good, 1972 |

Condensed phase thermochemistry data

Data compiled as indicated in comments:
ALS - Hussein Y. Afeefy, Joel F. Liebman, and Stephen E. Stein
DH - Eugene S. Domalski and Elizabeth D. Hearing
Quantity | Value | Units | Method | Reference | Comment |
---|---|---|---|---|---|
ΔfH°liquid | 14.91 ± 0.12 | kcal/mol | Ccb | Good, 1972 | ALS |
Quantity | Value | Units | Method | Reference | Comment |
ΔcH°liquid | -724.27 ± 0.10 | kcal/mol | Ccb | Good, 1972 | ALS |
Quantity | Value | Units | Method | Reference | Comment |
S°liquid | 47.9252 | cal/mol*K | N/A | Messerly, Todd, et al., 1988 | DH |
S°liquid | 47.916 | cal/mol*K | N/A | Messerly, Todd, et al., 1987 | DH |
S°liquid | 47.916 | cal/mol*K | N/A | Steele, Chirico, et al., 1986 | DH |
Constant pressure heat capacity of liquid
Cp,liquid (cal/mol*K) | Temperature (K) | Reference | Comment |
---|---|---|---|
35.8647 | 298.150 | Messerly, Todd, et al., 1988 | T = 10 to 400 K.; DH |
35.865 | 298.15 | Messerly, Todd, et al., 1987 | T = 10 to 370 K.; DH |
35.865 | 298.15 | Steele, Chirico, et al., 1986 | T = 10 to 370 K.; DH |

Phase change data

Data compiled as indicated in comments:
BS - Robert L. Brown and Stephen E. Stein
TRC - Thermodynamics Research Center, NIST Boulder Laboratories, Chris Muzny director
DH - Eugene S. Domalski and Elizabeth D. Hearing
ALS - Hussein Y. Afeefy, Joel F. Liebman, and Stephen E. Stein
DRB - Donald R. Burgess, Jr.
AC - William E. Acree, Jr., James S. Chickos
Quantity | Value | Units | Method | Reference | Comment |
---|---|---|---|---|---|
Tboil | 386. ± 1. | K | AVG | N/A | Average of 6 values; Individual data points |
Quantity | Value | Units | Method | Reference | Comment |
Tfus | 216.912 | K | N/A | Steele, Chirico, et al., 1986 | DH |
Tfus | 216.82 | K | N/A | Guanquan, Ott, et al., 1986 | Uncertainty assigned by TRC = 0.08 K; TRC |
Tfus | 231.2 | K | N/A | Milazzo, 1941 | Uncertainty assigned by TRC = 0.5 K; TRC |
Quantity | Value | Units | Method | Reference | Comment |
Ttriple | 216.910 | K | N/A | Messerly, Todd, et al., 1988, 2 | Uncertainty assigned by TRC = 0.03 K; obs. at indicated sample purity.; TRC |
Ttriple | 216.910 | K | N/A | Messerly, Todd, et al., 1988, 2 | Uncertainty assigned by TRC = 0.02 K; calc for 100% purity; TRC |
Ttriple | 216.87 | K | N/A | Anonymous, 1960 | Uncertainty assigned by TRC = 0.01 K; TRC |
Quantity | Value | Units | Method | Reference | Comment |
ΔvapH° | 10.7 ± 0.005 | kcal/mol | V | Messerly, Todd, et al., 1988, 2 | ALS |
ΔvapH° | 9.74 ± 0.05 | kcal/mol | V | Good, 1972 | ALS |
ΔvapH° | 9.73 | kcal/mol | N/A | Good, 1972 | DRB |
Enthalpy of vaporization
ΔvapH (kcal/mol) | Temperature (K) | Method | Reference | Comment |
---|---|---|---|---|
9.3 | 336. | A,EB,IP | Stephenson and Malanowski, 1987 | Based on data from 321. to 423. K. See also Osborn and Douslin, 1968 and Dykyj, 1972.; AC |
9.1 | 343. | I | Eon, Pommier, et al., 1971 | Based on data from 333. to 373. K.; AC |
Antoine Equation Parameters
log10(P) = A − (B / (T + C))
P = vapor pressure (atm)
T = temperature (K)
View plot Requires a JavaScript / HTML 5 canvas capable browser.
Temperature (K) | A | B | C | Reference | Comment |
---|---|---|---|---|---|
333.4 to 373.5 | 5.20776 | 2030.123 | 5.169 | Eon, Pommier, et al., 1971 | Coefficents calculated by NIST from author's data. |
322.11 to 422.59 | 4.2071 | 1370.499 | -60.141 | Osborn and Douslin, 1968 |
Enthalpy of fusion
ΔfusH (kcal/mol) | Temperature (K) | Reference | Comment |
---|---|---|---|
1.87017 | 216.912 | Messerly, Todd, et al., 1988 | DH |
1.8702 | 216.912 | Messerly, Todd, et al., 1987 | DH |
1.87 | 216.9 | Domalski and Hearing, 1996 | AC |
Entropy of fusion
ΔfusS (cal/mol*K) | Temperature (K) | Reference | Comment |
---|---|---|---|
8.621 | 216.912 | Messerly, Todd, et al., 1987 | DH |

Reaction thermochemistry data

Data compiled as indicated in comments:
B - John E. Bartmess
RCD - Robert C. Dunbar
Individual Reactions
C5H6N- + =
By formula: C5H6N- + H+ = C5H7N
Quantity | Value | Units | Method | Reference | Comment |
---|---|---|---|---|---|
ΔrH° | 392.8 ± 3.1 | kcal/mol | G+TS | DePuy, Kass, et al., 1988 | gas phase; Anion of N-methyl-pyrrole. Between Me2NH, H2O.; B |
Quantity | Value | Units | Method | Reference | Comment |
ΔrG° | 386.0 ± 3.0 | kcal/mol | IMRB | DePuy, Kass, et al., 1988 | gas phase; Anion of N-methyl-pyrrole. Between Me2NH, H2O.; B |
By formula: Li+ + C5H7N = (Li+ • C5H7N)
Quantity | Value | Units | Method | Reference | Comment |
---|---|---|---|---|---|
ΔrH° | 44.5 ± 4.0 | kcal/mol | CIDT | Huang and Rodgers, 2002 | RCD |
By formula: Na+ + C5H7N = (Na+ • C5H7N)
Quantity | Value | Units | Method | Reference | Comment |
---|---|---|---|---|---|
ΔrH° | 26.6 ± 0.8 | kcal/mol | CIDT | Huang and Rodgers, 2002 | RCD |
By formula: K+ + C5H7N = (K+ • C5H7N)
Quantity | Value | Units | Method | Reference | Comment |
---|---|---|---|---|---|
ΔrH° | 21.0 ± 1.5 | kcal/mol | CIDT | Huang and Rodgers, 2002 | RCD |

Gas phase ion energetics data

Data evaluated as indicated in comments:
L - Sharon G. Lias
Data compiled as indicated in comments:
B - John E. Bartmess
LLK - Sharon G. Lias, Rhoda D. Levin, and Sherif A. Kafafi
RDSH - Henry M. Rosenstock, Keith Draxl, Bruce W. Steiner, and John T. Herron
Quantity | Value | Units | Method | Reference | Comment |
---|---|---|---|---|---|
IE (evaluated) | 7.99 ± 0.07 | eV | N/A | N/A | L |
Ionization energy determinations
IE (eV) | Method | Reference | Comment |
---|---|---|---|
7.94 ± 0.02 | PI | Cooper, Williamson, et al., 1980 | LLK |
8.4 | EI | Sucrow, Bethke, et al., 1971 | LLK |
8.09 ± 0.01 | PI | Potapov and Yuzhakova, 1970 | RDSH |
7.95 ± 0.05 | PE | Baker, Betteridge, et al., 1970 | RDSH |
Appearance energy determinations
Ion | AE (eV) | Other Products | Method | Reference | Comment |
---|---|---|---|---|---|
C5H6N+ | 11.2 ± 0.1 | H | PI | Potapov and Yuzhakova, 1970 | RDSH |
De-protonation reactions
C5H6N- + =
By formula: C5H6N- + H+ = C5H7N
Quantity | Value | Units | Method | Reference | Comment |
---|---|---|---|---|---|
ΔrH° | 392.8 ± 3.1 | kcal/mol | G+TS | DePuy, Kass, et al., 1988 | gas phase; Anion of N-methyl-pyrrole. Between Me2NH, H2O.; B |
Quantity | Value | Units | Method | Reference | Comment |
ΔrG° | 386.0 ± 3.0 | kcal/mol | IMRB | DePuy, Kass, et al., 1988 | gas phase; Anion of N-methyl-pyrrole. Between Me2NH, H2O.; B |

Ion clustering data

Data compiled by: Robert C. Dunbar
Clustering reactions
By formula: K+ + C5H7N = (K+ • C5H7N)
Quantity | Value | Units | Method | Reference | Comment |
---|---|---|---|---|---|
ΔrH° | 21.0 ± 1.5 | kcal/mol | CIDT | Huang and Rodgers, 2002 |
By formula: Li+ + C5H7N = (Li+ • C5H7N)
Quantity | Value | Units | Method | Reference | Comment |
---|---|---|---|---|---|
ΔrH° | 44.5 ± 4.0 | kcal/mol | CIDT | Huang and Rodgers, 2002 |
By formula: Na+ + C5H7N = (Na+ • C5H7N)
Quantity | Value | Units | Method | Reference | Comment |
---|---|---|---|---|---|
ΔrH° | 26.6 ± 0.8 | kcal/mol | CIDT | Huang and Rodgers, 2002 |

Normal alkane RI, non-polar column, custom temperature program

Data compiled by: NIST Mass Spectrometry Data Center, William E. Wallace, director

Column type CapillaryCapillaryCapillaryCapillaryCapillary
Active phase SLB-5MSSE-30SPB-5Methyl phenyl siloxane (not specified)CP Sil 8 CB
Column length (m) 10. 60. 60.
Carrier gas Helium
Substrate
Column diameter (mm) 0.18 0.32 0.25
Phase thickness (μm) 0.18 1. 0.25
Program not specifiednot specifiednot specifiednot specifiednot specified
I 731.715.735.740.738.
ReferenceRisticevic, Carasek, et al., 2008Vinogradov, 2004Begnaud, Pérès, et al., 2003Poligne, Collignan, et al., 2002Duckham, Dodson, et al., 2001
Comment MSDC-RI MSDC-RI MSDC-RI MSDC-RI MSDC-RI
Column type CapillaryCapillaryCapillaryCapillaryCapillary
Active phase DB-5 MSSPB-1DB-5DB-5SPB-1
Column length (m) 30.60.50.50.60.
Carrier gas HeliumHeHeHeHelium
Substrate
Column diameter (mm) 0.250.530.320.320.53
Phase thickness (μm) 1.05.0.250.255.0
Program not specified40C(6min) => 5C/min => 80C => 10C/min => 200C40C (10min) => 3C/min => 95C => 10C/min => 270C (10min)40C (10min) => 3C/min => 95C => 10C/min => 270C (10min)40 0C (6 min) 5 0C/min -> 80 0C 10 0C/min -> 200 0C
I 737.722.743.744.722.
ReferenceLuo and Agnew, 2001Flanagan, Streete, et al., 1997Mateo and Zumalacárregui, 1996Mateo and Zumalacárregui, 1996Strete, Ruprah, et al., 1992
Comment MSDC-RI MSDC-RI MSDC-RI MSDC-RI MSDC-RI
Column type CapillaryCapillaryCapillaryCapillary
Active phase SPB-1DB-1DB-1OV-1
Column length (m) 60.60.60.
Carrier gas Helium
Substrate
Column diameter (mm) 0.530.250.25
Phase thickness (μm) 5.00.250.25
Program not specifiednot specifiednot specifiednot specified
I 715.715.717.715.
ReferenceStrete, Ruprah, et al., 1992Kawai, Ishida, et al., 1991Kawai, Ishida, et al., 1991Ramsey and Flanagan, 1982
Comment MSDC-RI MSDC-RI MSDC-RI MSDC-RI

Van Den Dool and Kratz RI, non-polar column, custom temperature program

Data compiled by: NIST Mass Spectrometry Data Center, William E. Wallace, director

Column type CapillaryCapillary
Active phase ZB-5CP Sil 8 CB
Column length (m) 30.60.
Carrier gas He
Substrate
Column diameter (mm) 0.250.25
Phase thickness (μm) 0.250.25
Program 50C(1min) => 3C/min => 209C => 20C/min => 280C0C => rapidly => 40C(8min) => 4C/min => 250C(10min)
I 760.751.
ReferenceLu, Hao, et al., 2005Duckham, Dodson, et al., 2001
Comment MSDC-RI MSDC-RI

Van Den Dool and Kratz RI, polar column, custom temperature program

Data compiled by: NIST Mass Spectrometry Data Center, William E. Wallace, director

Column type Capillary
Active phase Supelcowax-10
Column length (m) 30.
Carrier gas He
Substrate
Column diameter (mm) 0.25
Phase thickness (μm) 0.25
Program 35C(8min) => 4C/min => 60C => 6C/min => 160C => 20C/min => 200C(1min)
I 1153.
ReferenceBianchi, Careri, et al., 2007
Comment MSDC-RI

Normal alkane RI, polar column, custom temperature program

Data compiled by: NIST Mass Spectrometry Data Center, William E. Wallace, director

Column type CapillaryCapillaryCapillaryCapillaryCapillary
Active phase HP-InnowaxDB-WaxDB-WaxCarbowax 20MSupelcowax 10
Column length (m) 60.30.30. 60.
Carrier gas HeliumHydrogenHydrogen Helium
Substrate
Column diameter (mm) 0.250.250.25 0.25
Phase thickness (μm) 0.250.250.25 0.25
Program not specified44 0C 3 0C/min -> 170 0C 8 0C/min -> 250 0Cnot specifiednot specified60 0C (10 min) 2 0C/min -> 80 0C 3 0C/min -> 100 0C 4 0C/min -> 220 0C (30 min)
I 1147.1139.1139.1139.1132.
ReferenceFeng, Zhuang, et al., 2011Gonzalez-Rios, Suarez-Quiroz, et al., 2007Gonzalez-Rios, Suarez-Quiroz, et al., 2007Vinogradov, 2004Castioni and Kapetanidis, 1996
Comment MSDC-RI MSDC-RI MSDC-RI MSDC-RI MSDC-RI
Column type CapillaryCapillaryCapillaryCapillaryCapillary
Active phase Supelcowax 10Supelcowax 10DB-WaxDB-WaxCarbowax 20M
Column length (m) 60.60.
Carrier gas HeliumHelium
Substrate
Column diameter (mm) 0.250.25
Phase thickness (μm) 0.250.25
Program not specifiednot specifiednot specifiednot specifiednot specified
I 1134.1144.1139.1142.1139.
ReferenceCastioni and Kapetanidis, 1996Castioni and Kapetanidis, 1996Peng, Yang, et al., 1991Peng, Yang, et al., 1991Ramsey and Flanagan, 1982
Comment MSDC-RI MSDC-RI MSDC-RI MSDC-RI MSDC-RI

Van Den Dool and Kratz RI, polar column, temperature ramp

Data compiled by: NIST Mass Spectrometry Data Center, William E. Wallace, director

Column type CapillaryCapillaryCapillaryCapillaryCapillary
Active phase DB-WaxDB-WaxFFAPDB-WaxDB-Wax
Column length (m) 30.60.30.30.60.
Carrier gas HeHeHeHeHe
Substrate
Column diameter (mm) 0.320.250.250.250.25
Phase thickness (μm) 0.50.250.250.250.25
Tstart (C) 40.40.20.20.50.
Tend (C) 240.200.200.200.230.
Heat rate (K/min) 5.2.4.4.2.
Initial hold (min)  5.1.5.
Final hold (min) 10.30.1.10.60.
I 1149.1134.1155.1137.1142.
ReferenceLopez-Galilea I., Fournier N., et al., 2006Kim, 2001Ott, Fay, et al., 1997Ott, Fay, et al., 1997Shimoda, Shiratsuchi, et al., 1996
Comment MSDC-RI MSDC-RI MSDC-RI MSDC-RI MSDC-RI

References

Good, 1972
Good, W.D.,
Enthalpies of combustion of nine organic nitrogen compounds related to petroleum,
J. Chem. Eng. Data, 1972, 17, 28-31. [all data]
Messerly, Todd, et al., 1988
Messerly, J.F.; Todd, S.S.; Finke, H.L.; Good, W.D.; Gammon, B.E.,
Condensed-phase heat-capacity studies and derived thermodynamic properties for six cyclic nitrogen compounds,
J. Chem. Thermodynam., 1988, 20, 209-224. [all data]
Messerly, Todd, et al., 1987
Messerly, J.F.; Todd, S.S.; Finke, H.L.; Gammon, B.E.,
Thermodynamic properties of organic nitrogen compounds that occur in shale oil and heavy petroleum-topical report,
NIPER Report, 1987, 83, 37p. [all data]
Steele, Chirico, et al., 1986
Steele, W.V.; Chirico, R.D.; Collier, W.B.; Hossenlopp, I.A.; Nguyen, A.; Strube, M.M.,
Thermochemical and thermophysical properties of organic nitrogen compounds found in fossil materials,
NIPER Report, 1986, 188, 112p. [all data]
Guanquan, Ott, et al., 1986
Guanquan, C.; Ott, J.B.; Goates, J.R.,
(Solid + liquid) Phase Equilibria and Solid-Compound Formation in Tetrachloromethane + furan, + Pyridine, and + N-methylpyrrole,
J. Chem. Thermodyn., 1986, 18, 603. [all data]
Milazzo, 1941
Milazzo, G.,
Boll. Sci. Facolta Chim. Ind. Bologna, 1941, 94. [all data]
Messerly, Todd, et al., 1988, 2
Messerly, J.F.; Todd, s.S.; Finke, H.L.; Good, W.D.; Gammon, B.E.,
Condensed-phase heat-capacity studies and derived thermodynamic properties for six cyclic nitrogen compounds,
J. Chem. Thermodyn., 1988, 20, 209. [all data]
Anonymous, 1960
Anonymous, R.,
, Natl. Bur. Stand. (U. S.), Tech. News Bull. 44, 1960. [all data]
Stephenson and Malanowski, 1987
Stephenson, Richard M.; Malanowski, Stanislaw,
Handbook of the Thermodynamics of Organic Compounds, 1987, https://doi.org/10.1007/978-94-009-3173-2
. [all data]
Osborn and Douslin, 1968
Osborn, Ann G.; Douslin, Donald R.,
Vapor pressure relations of 13 nitrogen compounds related to petroleum,
J. Chem. Eng. Data, 1968, 13, 4, 534-537, https://doi.org/10.1021/je60039a024
. [all data]
Dykyj, 1972
Dykyj, J.,
Petrochemia, 1972, 12, 1, 13. [all data]
Eon, Pommier, et al., 1971
Eon, C.; Pommier, C.; Guiochon, G.,
Vapor pressures and second virial coefficients of some five-membered heterocyclic derivatives,
J. Chem. Eng. Data, 1971, 16, 4, 408-410, https://doi.org/10.1021/je60051a008
. [all data]
Domalski and Hearing, 1996
Domalski, Eugene S.; Hearing, Elizabeth D.,
Heat Capacities and Entropies of Organic Compounds in the Condensed Phase. Volume III,
J. Phys. Chem. Ref. Data, 1996, 25, 1, 1, https://doi.org/10.1063/1.555985
. [all data]
DePuy, Kass, et al., 1988
DePuy, C.H.; Kass, S.R.; Bean, G.P.,
Formation and Reactions of Heteroaromatic Anions in the Gas Phase,
J. Org. Chem., 1988, 53, 19, 4427, https://doi.org/10.1021/jo00254a001
. [all data]
Huang and Rodgers, 2002
Huang, H.; Rodgers, M.T.,
Sigma versus Pi interactions in alkali metal ion binding to azoles: Threshold collision-induced dissociation and ab initio theory studies,
J. Phys. Chem. A, 2002, 106, 16, 4277, https://doi.org/10.1021/jp013630b
. [all data]
Cooper, Williamson, et al., 1980
Cooper, C.D.; Williamson, A.D.; Miller, J.C.; Compton, R.N.,
Resonantly enhanced multiphoton ionization of pyrrole, N-methyl pyrrole, and furan,
J. Chem. Phys., 1980, 73, 1527. [all data]
Sucrow, Bethke, et al., 1971
Sucrow, W.; Bethke, H.; Chondromatidis, G.,
Thermolyse von 1.2.4.5-Tetramethyl-hexahydro- 1.2.4.5-tetrazinen im Massenspektrometer,
Tetrahedron Lett., 1971, 19, 1481. [all data]
Potapov and Yuzhakova, 1970
Potapov, V.K.; Yuzhakova, O.A.,
Photoionization and electronic structure of pyrrole and its methyl derivatives,
Dokl. Akad. Nauk SSSR, 1970, 192, 131, In original 365. [all data]
Baker, Betteridge, et al., 1970
Baker, A.D.; Betteridge, D.; Kemp, N.R.; Kirby, R.E.,
Application of photoelectron spectrometry to pesticide analysis. Photoelectron spectra of fivemembered heterocycles and related molecules,
Anal. Chem., 1970, 42, 1064. [all data]