Manganese, η5-hexa-2,4-dien-1-yl tricarbonyl
- Formula: C9H9MnO3
- Molecular weight: 220.1040
- CAS Registry Number: 96480-95-4

Gas phase ion energetics data

Data compiled by: Sharon G. Lias, John E. Bartmess, Joel F. Liebman, John L. Holmes, Rhoda D. Levin, and W. Gary Mallard
Ionization energy determinations
IE (eV) | Method | Reference | Comment |
---|---|---|---|
7.4 | PE | Green, Paz-Sandoval, et al., 1985 | |
7.77 | PE | Green, Paz-Sandoval, et al., 1985 | Vertical value |

References

Green, Paz-Sandoval, et al., 1985
Green, J.C.; Paz-Sandoval, M.; Powell, P.,
He I and He II ohotoelectron spectra of open-chain pentadienyl complexes of manganese and rhenium,
J. Chem. Soc. Dalton Trans., 1985, 2677. [all data]