Butyrolactone
- Formula: C4H6O2
- Molecular weight: 86.0892
- IUPAC Standard InChIKey: YEJRWHAVMIAJKC-UHFFFAOYSA-N
- CAS Registry Number: 96-48-0
- Chemical structure:
View 3d structure (requires JavaScript / HTML 5) - Species with the same structure:
- Other names: 2(3H)-Furanone, dihydro-; γ-Butyrolactone; γ-BL; γ-Hydroxybutyric acid cyclic ester; γ-Hydroxybutyric acid lactone; γ-Hydroxybutyrolactone; Butanoic acid, 4-hydroxy-, γ-lactone; Butyric acid lactone; Butyryl lactone; Dihydro-2(3H)-furanone; Tetrahydro-2-furanone; 1,4-Butanolide; 4-Butanolide; 4-Butyrolactone; 4-Deoxytetronic acid; 4-Hydroxybutanoic acid lactone; 4-Hydroxybutyric acid lactone; 6480; 1,4-Butyrolactone; γ-6480; Butyric acid, 4-hydroxy-, γ-lactone; Butyrylactone; BLO; BLON; Dihydro-2-furanone; NCI-C55878; 1,2-Butanolide; 4-Hydroxybutanoic acid, γ-lactone; 4-Hydroxybutyric acid, γ-lactone; 2-Oxolanone; 1-Oxacyclopentan-2-one; 2-Oxotetrahydrofuran; γ-Butanolactone; γ-Hydrooxybutyric acid lactone; Agrisynth BLO; GBL; Butyric acid, 4-hydroxy-, gamma-lactone; 2(3H)-dihydrofuranone; Dihydro-(3 H)-furan-2-one; Dihydrofuran-2(3H)-one; NSC 4592; dihydro-2(3H)-furanone (γ-butyrolactone); Tetrahydrofuran-2-one; Dihydro-2(3H)-furanone (-butyrolactone); Butan-4-olide; 2-Dihydrofuranone

Gas phase thermochemistry data

Data compiled as indicated in comments:
ALS - Hussein Y. Afeefy, Joel F. Liebman, and Stephen E. Stein
DRB - Donald R. Burgess, Jr.
GT - Glushko Thermocenter, Russian Academy of Sciences, Moscow
Quantity | Value | Units | Method | Reference | Comment |
---|---|---|---|---|---|
ΔfH°gas | -87.0 ± 0.8 | kcal/mol | Cm | Wiberg and Waldron, 1991 | Heat of reduction; ALS |
ΔfH°gas | -87.6 ± 0.2 | kcal/mol | Ccb | Leitao, Pilcher, et al., 1990 | See Brown, Conn, et al., 1989; ALS |
ΔfH°gas | -87.38 ± 0.11 | kcal/mol | Ccb | Steele, Chirico, et al., 1989 | ALS |
ΔfH°gas | -90.27 | kcal/mol | N/A | Ismailov, Gabzalilova, et al., 1988 | Value computed using ΔfHliquid° value of -431.2±2.7 kj/mol from Ismailov, Gabzalilova, et al., 1988 and ΔvapH° value of 53.5 kj/mol from Steele, Chirico, et al., 1989.; DRB |
ΔfH°gas | -88.07 | kcal/mol | N/A | Yevstropov, Lebedev, et al., 1980 | Value computed using ΔfHliquid° value of -422.0±1.1 kj/mol from Yevstropov, Lebedev, et al., 1980 and ΔvapH° value of 53.5 kj/mol from Steele, Chirico, et al., 1989.; DRB |
Constant pressure heat capacity of gas
Cp,gas (cal/mol*K) | Temperature (K) | Reference | Comment |
---|---|---|---|
10.39 | 100. | Kudchadker S.A., 1975 | GT |
12.19 | 150. | ||
14.54 | 200. | ||
18.93 | 273.15 | ||
20.58 | 298.15 | ||
20.70 | 300. | ||
27.304 | 400. | ||
33.167 | 500. | ||
38.045 | 600. | ||
42.067 | 700. | ||
45.406 | 800. | ||
48.205 | 900. | ||
50.562 | 1000. | ||
52.560 | 1100. | ||
54.259 | 1200. | ||
55.712 | 1300. | ||
56.962 | 1400. | ||
58.035 | 1500. |

Condensed phase thermochemistry data

Data compiled as indicated in comments:
ALS - Hussein Y. Afeefy, Joel F. Liebman, and Stephen E. Stein
DH - Eugene S. Domalski and Elizabeth D. Hearing
Quantity | Value | Units | Method | Reference | Comment |
---|---|---|---|---|---|
ΔfH°liquid | -100.2 ± 0.6 | kcal/mol | Cm | Wiberg and Waldron, 1991 | Heat of reduction; ALS |
ΔfH°liquid | -100.6 ± 0.2 | kcal/mol | Ccb | Leitao, Pilcher, et al., 1990 | See Brown, Conn, et al., 1989; ALS |
ΔfH°liquid | -100.16 ± 0.086 | kcal/mol | Ccb | Steele, Chirico, et al., 1989 | ALS |
ΔfH°liquid | -103.1 ± 0.65 | kcal/mol | Ccb | Ismailov, Gabzalilova, et al., 1988 | ALS |
ΔfH°liquid | -100.9 ± 0.26 | kcal/mol | Ccb | Yevstropov, Lebedev, et al., 1980 | ALS |
Quantity | Value | Units | Method | Reference | Comment |
ΔcH°liquid | -480.5 ± 0.1 | kcal/mol | Ccb | Leitao, Pilcher, et al., 1990 | See Brown, Conn, et al., 1989; Corresponding ΔfHºliquid = -100.6 kcal/mol (simple calculation by NIST; no Washburn corrections); ALS |
ΔcH°liquid | -480.989 ± 0.067 | kcal/mol | Ccb | Steele, Chirico, et al., 1989 | Corresponding ΔfHºliquid = -100.16 kcal/mol (simple calculation by NIST; no Washburn corrections); ALS |
ΔcH°liquid | -478.1 ± 1.5 | kcal/mol | Ccb | Ismailov, Gabzalilova, et al., 1988 | Corresponding ΔfHºliquid = -103.04 kcal/mol (simple calculation by NIST; no Washburn corrections); ALS |
ΔcH°liquid | -480.2 ± 0.2 | kcal/mol | Ccb | Yevstropov, Lebedev, et al., 1980 | Corresponding ΔfHºliquid = -100.9 kcal/mol (simple calculation by NIST; no Washburn corrections); ALS |
Quantity | Value | Units | Method | Reference | Comment |
S°liquid | 47.18 | cal/mol*K | N/A | Lebedev and Yevstropov, 1983 | DH |
S°liquid | 47.20 | cal/mol*K | N/A | Yevstropov, Lebedev, et al., 1980, 2 | DH |
S°liquid | 48.107 | cal/mol*K | N/A | Ismailov, Gabzalilova, et al., 1988 | DH |
Constant pressure heat capacity of liquid
Cp,liquid (cal/mol*K) | Temperature (K) | Reference | Comment |
---|---|---|---|
33.58 | 298.15 | Steele, Chirico, et al., 1989 | DH |
33.68 | 298.15 | Ismailov, Gabzalilova, et al., 1988 | T = 290 to 410 K. Cp(liq) = 101.0829 + 763.3375X10-4T + 1.918968x10-4T2 J/mol*K (290 to 410 K).; DH |
33.77 | 298.15 | Lebedev and Yevstropov, 1983 | T = 13.8 to 340 K.; DH |
33.77 | 298.15 | Yevstropov, Lebedev, et al., 1980, 2 | T = 5 to 330 K.; DH |
33.80 | 298.15 | Fuchs, 1979 | DH |

Phase change data

Data compiled as indicated in comments:
BS - Robert L. Brown and Stephen E. Stein
TRC - Thermodynamics Research Center, NIST Boulder Laboratories, Chris Muzny director
AC - William E. Acree, Jr., James S. Chickos
ALS - Hussein Y. Afeefy, Joel F. Liebman, and Stephen E. Stein
DRB - Donald R. Burgess, Jr.
DH - Eugene S. Domalski and Elizabeth D. Hearing
Quantity | Value | Units | Method | Reference | Comment |
---|---|---|---|---|---|
Tboil | 477.7 | K | N/A | Aldrich Chemical Company Inc., 1990 | BS |
Tboil | 479.20 | K | N/A | Vasil'eva, Naumova, et al., 1990 | Uncertainty assigned by TRC = 0.2 K; TRC |
Quantity | Value | Units | Method | Reference | Comment |
Tfus | 229.0 | K | N/A | Anonymous, 1954 | Uncertainty assigned by TRC = 0.6 K; TRC |
Quantity | Value | Units | Method | Reference | Comment |
Ttriple | 229.78 | K | N/A | Lebedev and Yevstropov, 1983, 2 | Uncertainty assigned by TRC = 0.02 K; TRC |
Ttriple | 229.78 | K | N/A | Evstropov, Lebedev, et al., 1980 | Crystal phase 1 phase; Uncertainty assigned by TRC = 0.01 K; TRC |
Ttriple | 229.78 | K | N/A | Evstropov, Lebedev, et al., 1979 | Uncertainty assigned by TRC = 0.05 K; TRC |
Quantity | Value | Units | Method | Reference | Comment |
Tc | 731.0 | K | N/A | Wilson, Wilson, et al., 1996 | Uncertainty assigned by TRC = 0.4 K; TRC |
Quantity | Value | Units | Method | Reference | Comment |
Pc | 50.64 | atm | N/A | Wilson, Wilson, et al., 1996 | Uncertainty assigned by TRC = 0.39 atm; TRC |
Quantity | Value | Units | Method | Reference | Comment |
ΔvapH° | 13. ± 1. | kcal/mol | AVG | N/A | Average of 16 values; Individual data points |
Reduced pressure boiling point
Tboil (K) | Pressure (atm) | Reference | Comment |
---|---|---|---|
362.2 | 0.016 | Weast and Grasselli, 1989 | BS |
Enthalpy of vaporization
ΔvapH (kcal/mol) | Temperature (K) | Method | Reference | Comment |
---|---|---|---|---|
11.8 ± 0.02 | 392. | EB | Wiberg and Waldron, 1991 | Based on data from 378. to 406. K.; AC |
12.4 ± 0.1 | 357. | MM | Wiberg and Waldron, 1991 | Based on data from 345. to 370. K.; AC |
11.5 | 407. | A | Stephenson and Malanowski, 1987 | Based on data from 392. to 474. K.; AC |
10.8 ± 0.1 | 349. | V | Yevstropov, Lebedev, et al., 1980 | ALS |
Enthalpy of fusion
ΔfusH (kcal/mol) | Temperature (K) | Reference | Comment |
---|---|---|---|
2.287 | 229.78 | Lebedev and Yevstropov, 1983 | DH |
2.287 | 229.78 | Yevstropov, Lebedev, et al., 1980, 2 | DH |
2.29 | 230. | Acree, 1991 | AC |
Entropy of fusion
ΔfusS (cal/mol*K) | Temperature (K) | Reference | Comment |
---|---|---|---|
9.933 | 229.78 | Lebedev and Yevstropov, 1983 | DH |
9.933 | 229.78 | Yevstropov, Lebedev, et al., 1980, 2 | DH |

Reaction thermochemistry data

Data compiled by: Hussein Y. Afeefy, Joel F. Liebman, and Stephen E. Stein
Individual Reactions
By formula: C4H8O3 = H2O + C4H6O2
Quantity | Value | Units | Method | Reference | Comment |
---|---|---|---|---|---|
ΔrH° | 1.08 ± 0.05 | kcal/mol | Cm | Wiberg and Waldron, 1991 | liquid phase |

Gas phase ion energetics data

Data evaluated as indicated in comments:
HL - Edward P. Hunter and Sharon G. Lias
Data compiled as indicated in comments:
LLK - Sharon G. Lias, Rhoda D. Levin, and Sherif A. Kafafi
Quantity | Value | Units | Method | Reference | Comment |
---|---|---|---|---|---|
Proton affinity (review) | 200.8 | kcal/mol | N/A | Hunter and Lias, 1998 | HL |
Quantity | Value | Units | Method | Reference | Comment |
Gas basicity | 193.1 | kcal/mol | N/A | Hunter and Lias, 1998 | HL |
Ionization energy determinations
IE (eV) | Method | Reference | Comment |
---|---|---|---|
10.26 | PE | Gerson, Worley, et al., 1978 | Vertical value; LLK |
10.26 | PE | Bain and Frost, 1973 | Vertical value; LLK |

Kovats' RI, non-polar column, isothermal

Column type | Active phase | Temperature (C) | I | Reference | Comment |
---|---|---|---|---|---|
Packed | DC-200 | 120. | 875. | Reymond, Mueggler-Chavan, et al., 1966 | Celite; Column length: 4. m |
Packed | SE-30 | 120. | 895. | Viani, Müggler-Chavan, et al., 1965 | He, Chromosorb P; Column length: 6. m |

Kovats' RI, non-polar column, temperature ramp

Column type | Active phase | I | Reference | Comment |
---|---|---|---|---|
Capillary | SE-54 | 908. | Rembold, Wallner, et al., 1989 | 30. m/0.25 mm/0.25 μm, He, 0. C @ 12. min, 12. K/min; Tend: 250. C |
Capillary | OV-101 | 865. | Ohnishi and Shibamoto, 1984 | 2. K/min; Column length: 50. m; Column diameter: 0.23 mm; Tstart: 80. C; Tend: 200. C |
Capillary | OV-101 | 866. | Ohnishi and Shibamoto, 1984 | 2. K/min; Column length: 50. m; Column diameter: 0.23 mm; Tstart: 80. C; Tend: 200. C |

Kovats' RI, polar column, temperature ramp

Column type | Active phase | I | Reference | Comment |
---|---|---|---|---|
Capillary | Carbowax 20M | 1595. | Tressl, Friese, et al., 1978 | He, 2. K/min; Column length: 50. m; Column diameter: 0.28 mm; Tstart: 70. C; Tend: 190. C |

Kovats' RI, polar column, custom temperature program

Column type | Active phase | I | Reference | Comment |
---|---|---|---|---|
Capillary | Carbowax 20M | 1641. | Brander, Kepner, et al., 1980 | Program: not specified |
Capillary | Carbowax 20M | 1645. | Brander, Kepner, et al., 1980 | Program: not specified |

Van Den Dool and Kratz RI, non-polar column, temperature ramp

Column type | Active phase | I | Reference | Comment |
---|---|---|---|---|
Capillary | SPB-5 | 915. | Engel and Ratel, 2007 | 60. m/0.32 mm/1. μm, 40. C @ 2. min, 3. K/min, 230. C @ 10. min |
Capillary | HP-5 | 915. | Quijano, Salamanca, et al., 2007 | 30. m/0.25 mm/0.25 μm, He, 50. C @ 4. min, 4. K/min, 250. C @ 10. min |
Capillary | CP Sil 8 CB | 901. | Mahadevan and Farmer, 2006 | 60. C @ 5. min, 4. K/min, 220. C @ 30. min; Column length: 50. m; Column diameter: 0.32 mm |
Capillary | DB-1 | 870. | Osorio, Alarcon, et al., 2006 | 25. m/0.2 mm/0.33 μm, 4. K/min; Tstart: 50. C; Tend: 300. C |
Capillary | HP-5MS | 915. | Pino, Mesa, et al., 2005 | 30. m/0.25 mm/0.25 μm, He, 60. C @ 2. min, 4. K/min, 250. C @ 20. min |
Capillary | SPB-5 | 920. | Pino, Marbot, et al., 2004 | 30. m/0.25 mm/0.25 μm, He, 60. C @ 2. min, 4. K/min, 250. C @ 20. min |
Capillary | SPB-5 | 916. | Pino, Marbot, et al., 2003 | 30. m/0.25 mm/0.25 μm, He, 60. C @ 2. min, 4. K/min, 250. C @ 20. min |
Capillary | DB-5 | 908. | Dallüge, van Stee, et al., 2002 | 30. m/0.25 mm/1. μm, He, 2.5 K/min; Tstart: 50. C; Tend: 200. C |
Capillary | HP-5MS | 922. | Kim T.H., Kim T.H., et al., 2002 | 30. m/0.25 mm/0.25 μm, He, 40. C @ 5. min, 3. K/min, 200. C @ 20. min |
Capillary | HP-5MS | 916. | Kim, Shin, et al., 2001 | 30. m/0.25 mm/0.25 μm, He, 40. C @ 5. min, 2. K/min, 200. C @ 20. min |
Capillary | DB-1 | 867. | Wu, Wang, et al., 2000 | 60. m/0.25 mm/1. μm, N2, 5. K/min, 200. C @ 30. min; Tstart: 30. C |
Capillary | DB-1 | 861. | Lee, DeMilo, et al., 1997 | 60. m/0.248 mm/0.25 μm, He, 5. K/min; Tstart: 50. C; Tend: 250. C |
Capillary | DB-1 | 862. | Lee, DeMilo, et al., 1997 | 60. m/0.248 mm/0.25 μm, He, 5. K/min; Tstart: 50. C; Tend: 250. C |
Capillary | DB-1 | 864. | Lee, DeMilo, et al., 1997 | 60. m/0.248 mm/0.25 μm, He, 5. K/min; Tstart: 50. C; Tend: 250. C |
Capillary | DB-5 | 917. | Guichard and Souty, 1988 | H2, 30. C @ 5. min, 1.5 K/min; Column length: 0.32 m; Column diameter: 1. mm; Tend: 180. C |

Van Den Dool and Kratz RI, polar column, temperature ramp

Column type | Active phase | I | Reference | Comment |
---|---|---|---|---|
Capillary | DB-Wax | 1626. | Botelho, Caldeira, et al., 2007 | 30. m/0.25 mm/0.25 μm, He, 50. C @ 2. min, 3.5 K/min, 180. C @ 25. min |
Capillary | DB-Wax | 1617. | Pozo-Bayon M.A., Ruiz-Rodriguez A., et al., 2007 | 30. m/0.25 mm/0.5 μm, He, 40. C @ 5. min, 4. K/min, 250. C @ 15. min |
Capillary | DB-Wax | 1602. | Pozo-Bayon M.A., Ruiz-Rodriguez A., et al., 2007 | 30. m/0.25 mm/0.5 μm, He, 40. C @ 5. min, 4. K/min, 250. C @ 15. min |
Capillary | DB-Wax | 1643. | Cho, Choi, et al., 2006 | 60. m/0.25 mm/0.25 μm, He, 40. C @ 1. min, 4. K/min, 200. C @ 10. min |
Capillary | DB-Wax | 1640. | Cho, Choi, et al., 2006 | 60. m/0.25 mm/0.25 μm, He, 40. C @ 1. min, 4. K/min, 200. C @ 10. min |
Capillary | Innowax | 1635. | Lee, Lee, et al., 2006 | 60. m/0.25 mm/0.25 μm, He, 40. C @ 4. min, 4. K/min, 230. C @ 20. min |
Capillary | CP-Wax 52CB | 1614. | Mahadevan and Farmer, 2006 | 60. C @ 5. min, 4. K/min, 220. C @ 30. min; Column length: 50. m; Column diameter: 0.32 mm |
Capillary | DB-Wax | 1611. | Osorio, Alarcon, et al., 2006 | 30. m/0.25 mm/0.25 μm, He, 50. C @ 4. min, 4. K/min, 220. C @ 20. min |
Capillary | Stabilwax | 1628. | Fang and Qian, 2005 | 30. m/0.32 mm/1. μm, N2, 40. C @ 2. min, 4. K/min, 230. C @ 10. min |
Capillary | Innowax | 1623. | Pena, Barciela, et al., 2005 | 30. m/0.25 mm/0.25 μm, He, 40. C @ 5. min, 5. K/min, 200. C @ 2. min |
Capillary | Supelcowax-10 | 1635. | Chung, Yung, et al., 2002 | 60. m/0.25 mm/0.25 μm, He, 35. C @ 5. min, 2. K/min, 195. C @ 90. min |
Capillary | DB-Wax | 1664. | Claudela, Dirningera, et al., 2002 | 60. m/0.32 mm/0.5 μm, He, 2.7 K/min, 235. C @ 30. min; Tstart: 67. C |
Capillary | DB-Wax | 1615. | Kim T.H., Kim T.H., et al., 2002 | 30. m/0.25 mm/0.25 μm, He, 40. C @ 5. min, 3. K/min, 200. C @ 20. min |
Capillary | Supelcowax-10 | 1635. | Chung, Yung, et al., 2001 | 60. m/0.25 mm/0.25 μm, He, 35. C @ 5. min, 2. K/min, 195. C @ 90. min |
Capillary | DB-Wax | 1601. | Kim, Shin, et al., 2001 | 30. m/0.25 mm/0.25 μm, He, 40. C @ 5. min, 2. K/min, 200. C @ 20. min |
Capillary | DB-FFAP | 1637. | Charles, Martin, et al., 2000 | 30. m/0.32 mm/0.25 μm, H2, 40. C @ 2. min, 5. K/min; Tend: 240. C |
Capillary | Supelcowax-10 | 1636. | Chung, 2000 | 60. m/0.25 mm/0.25 μm, He, 2. K/min, 195. C @ 90. min; Tstart: 35. C |
Capillary | CP-Wax 52CB | 1611. | Chevance and Farmer, 1999 | 60. C @ 5. min, 4. K/min, 220. C @ 30. min; Column length: 50. m; Column diameter: 0.32 mm |
Capillary | DB-Wax | 1607. | Umano, Hagi, et al., 1992 | He, 40. C @ 10. min, 2. K/min; Column length: 30. m; Column diameter: 0.25 mm; Tend: 200. C |
Capillary | CP-WAX 57CB | 1604. | Baltes and Mevissen, 1988 | He, 50. C @ 5. min, 2. K/min; Column length: 50. m; Column diameter: 0.24 mm; Tend: 210. C |

Van Den Dool and Kratz RI, polar column, custom temperature program

Column type | Active phase | I | Reference | Comment |
---|---|---|---|---|
Capillary | Supelcowax-10 | 1650. | Bianchi, Careri, et al., 2007 | 30. m/0.25 mm/0.25 μm, He; Program: 35C(8min) => 4C/min => 60C => 6C/min => 160C => 20C/min => 200C(1min) |
Capillary | Stabilwax | 1611. | Natali N., Chinnici F., et al., 2006 | 30. m/0.25 mm/0.25 μm, He; Program: 40C => 3C/min => 100C => 5C/min => 240C(10min) |
Capillary | DB-Wax | 1635. | Selli, Canbas, et al., 2006 | 30. m/0.32 mm/0.5 μm, H2; Program: 60C(3min) => 2C/min => 220C => 3C/min => 245C (20min) |
Capillary | DB-Wax | 1635. | Selli, Canbas, et al., 2006, 2 | 30. m/0.32 mm/0.5 μm, H2; Program: 60C(3min) => 2C/min => 220C => 3C/min => 245C(20min) |
Capillary | DB-Wax | 1635. | Selli, Cabaroglu, et al., 2004 | 30. m/0.32 mm/0.5 μm, H2; Program: 60C(3min) => 2C/min => 220C => 3C/min => 245C (20min) |
Capillary | Carbowax 20M | 1624. | Boido, Lloret, et al., 2003 | 25. m/0.32 mm/0.25 μm, H2; Program: 40C (8min) => 3C/min => 180C => 20C/min => 230C |
Capillary | DB-Wax | 1607. | Cantergiani, Brevard, et al., 2001 | 30. m/0.25 mm/0.25 μm; Program: 20C(30s) => fast => 60C => 4C/min => 220C (20min) |
Capillary | DB-Wax | 1666. | Radovic, Careri, et al., 2001 | 30. m/0.25 mm/0.25 μm; Program: 30C(8min) => 4C/min => 60C => 6C/min => 160C => 20C/min => 200C(1min) |
Capillary | Carbowax | 1618. | Baltes w. and Bochmann G., 1987 | Column diameter: 0.3 mm; Program: not specified |
Capillary | Carbowax | 1619. | Baltes w. and Bochmann G., 1987 | Column diameter: 0.3 mm; Program: not specified |
Capillary | Carbowax | 1619. | Baltes w. and Bochmann G., 1987 | Column diameter: 0.3 mm; Program: not specified |
Capillary | Carbowax | 1619. | Baltes w. and Bochmann G., 1987 | Column diameter: 0.3 mm; Program: not specified |
Capillary | Carbowax | 1624. | Baltes w. and Bochmann G., 1987 | Column diameter: 0.3 mm; Program: not specified |
Capillary | Carbowax 20M | 1670. | Whitfield, Shea, et al., 1981 | Column length: 150. m; Column diameter: 0.75 mm; Program: not specified |

Normal alkane RI, non-polar column, isothermal

Column type | Active phase | Temperature (C) | I | Reference | Comment |
---|---|---|---|---|---|
Packed | DC-400 | 150. | 894. | Anderson, 1968 | Helium, Gas-Pak (60-80 mesh); Column length: 3.0 m |

Normal alkane RI, non-polar column, temperature ramp

Column type | Active phase | I | Reference | Comment |
---|---|---|---|---|
Capillary | VF-5 MS | 913. | Leffingwell and Alford, 2011 | 60. m/0.32 mm/0.25 μm, Helium, 2. K/min, 260. C @ 28. min; Tstart: 30. C |
Capillary | VF-5 MS | 915. | Leffingwell and Alford, 2011 | 60. m/0.32 mm/0.25 μm, Helium, 2. K/min, 260. C @ 28. min; Tstart: 30. C |
Capillary | HP-5 | 915. | Piyachaiseth, Jirapakkul, et al., 2011 | 60. m/0.25 mm/0.25 μm, Helium, 35. C @ 1. min, 10. K/min, 220. C @ 15. min |
Capillary | SLB-5MS | 904. | Risticevic, Carasek, et al., 2008 | 10. m/0.18 mm/0.18 μm, Helium, 40. C @ 1.5 min, 10. K/min; Tend: 295. C |
Capillary | 5 % Phenyl methyl siloxane | 920. | Ramirez R. and Cava R., 2007 | 30. m/0.25 mm/1. μm, He, 40. C @ 10. min, 7. K/min, 250. C @ 5. min |
Capillary | SPB-5 | 916. | Vasta, Ratel, et al., 2007 | 60. m/0.32 mm/1. μm, 40. C @ 5. min, 3. K/min, 230. C @ 5. min |
Capillary | HP-5MS | 917. | Kim, Abd El-Aty, et al., 2006 | 30. m/0.25 mm/0.25 μm, He, 50. C @ 4. min, 5. K/min, 280. C @ 10. min |
Capillary | BPX5 | 938. | Dickschat, Bode, et al., 2005 | 25. m/0.22 mm/0.25 μm, Helium, 50. C @ 5. min, 5. K/min; Tend: 320. C |
Capillary | HP-5 | 913.8 | Leffingwell and Alford, 2005 | 60. m/0.32 mm/0.25 μm, He, 30. C @ 2. min, 2. K/min, 260. C @ 28. min |
Capillary | DB-5 | 908. | Pino, Marbot, et al., 2003, 2 | 30. m/0.25 mm/0.25 μm, H2, 60. C @ 10. min, 4. K/min, 280. C @ 40. min |
Capillary | SPB-5 | 909. | Sebastian, Viallon-Fernandez, et al., 2003 | 60. m/0.32 mm/1.0 μm, Helium, 3. K/min; Tstart: 30. C; Tend: 230. C |
Capillary | DB-1 | 871. | Chen and Ho, 1999 | 60. m/0.32 mm/1. μm, He, 2. K/min; Tstart: 40. C; Tend: 260. C |
Capillary | HP-5 | 912. | Jung, Wichmann, et al., 1999 | 25. m/0.20 mm/0.33 μm, 50. C @ 3. min, 5. K/min; Tend: 180. C |
Capillary | Ultra-2 | 908. | King, Hamilton, et al., 1993 | 50. m/0.32 mm/0.52 μm, He, 40. C @ 3. min, 4. K/min, 250. C @ 30. min |
Capillary | DB-5 | 925. | Georgilopoulos and Gallois, 1988 | 30. m/0.35 mm/1.0 μm, Hydrogen, 2. K/min; Tstart: 45. C; Tend: 220. C |
Capillary | DB-1 | 914. | Habu, Flath, et al., 1985 | 3. K/min; Column length: 50. m; Column diameter: 0.32 mm; Tstart: 0. C; Tend: 250. C |
Capillary | OV-101 | 867. | del Rosario, de Lumen, et al., 1984 | He, 0. C @ 1. min, 3. K/min; Column length: 50. m; Column diameter: 0.31 mm; Tend: 225. C |

Normal alkane RI, non-polar column, custom temperature program

Column type | Active phase | I | Reference | Comment |
---|---|---|---|---|
Capillary | SLB-5 MS | 922. | Mondello, 2012 | 30. m/0.25 mm/0.25 μm, Helium; Program: not specified |
Capillary | SLB-5 MS | 941. | Mondello, 2012 | 30. m/0.25 mm/0.25 μm, Helium; Program: not specified |
Capillary | Siloxane, 5 % Ph | 921. | VOC BinBase, 2012 | Program: not specified |
Capillary | Polydimethyl siloxane, 5 % phenyl | 921. | Skogerson, Wohlgemuth, et al., 2011 | Program: not specified |
Capillary | ZB-5 | 913. | de Simon, Estruelas, et al., 2009 | 30. m/0.25 mm/0.25 μm, Helium; Program: 45 0C 3 0C/min -> 230 0C (10 min) 10 0C/min -> 270 0C (21 min) |
Capillary | SLB-5MS | 941. | Risticevic, Carasek, et al., 2008 | 10. m/0.18 mm/0.18 μm, Helium; Program: not specified |
Capillary | HP-5 | 909. | Ventanas, Estevez, et al., 2008 | 50. m/0.32 mm/1.05 μm, Helium; Program: 40 0C (10 min) 5 0C/min -> 200 0C 15 0C/min -> 250 0C (10 min) |
Capillary | DB-5 MS | 917. | Liu, Xu, et al., 2007 | 60. m/0.32 mm/1.0 μm, Helium; Program: 40 0C (2 min) 6 0C/min -> 100 0C 4 0C/min -> 180 0C 8 0C/min -> 250 0C (12 min) |
Capillary | Polydimethyl siloxane with 5 % Ph groups | 920. | Pino, Marbot, et al., 2005 | Program: not specified |
Capillary | HP-5 | 915. | Garcia-Estaban, Ansorena, et al., 2004 | 50. m/0.32 mm/1.05 μm; Program: 40C(10min) => 5C/min => 200C => 20C/min => 250C(5min) |
Capillary | SPB-5 | 911. | Begnaud, Pérès, et al., 2003 | 60. m/0.32 mm/1. μm; Program: not specified |
Capillary | HP-5 | 891. | Jordán, Margaría, et al., 2003 | 30. m/0.25 mm/0.25 μm; Program: 40C(6min) => 2.5C/min => 150C => 90C/min => 250C |
Capillary | HP-5 | 891. | Jordán, Goodner, et al., 2002 | 30. m/0.25 mm/0.25 μm; Program: not specified |
Capillary | HP-5 | 910. | Jordán, Goodner, et al., 2002 | 30. m/0.25 mm/0.25 μm; Program: not specified |
Capillary | HP-5 | 891. | Jordán, Margaría, et al., 2002 | 30. m/0.25 mm/0.25 μm; Program: 40C (6min) => 2.5C/min => 150C => 90C/min => 250C |
Capillary | HP-5MS | 915. | Ansorena, Gimeno, et al., 2001 | 30. m/0.25 mm/0.25 μm, He; Program: 40C (10min) => 3C/min => 120C => 10C/min => 250C (5min) |
Capillary | DB-5 | 924. | Mateo, Aguirrezábal, et al., 1997 | 50. m/0.32 mm/0.25 μm, He; Program: 40C(10min) => 3C/min => 95C => 10C/min => 270C(10min) |
Capillary | DB-5 | 918. | Mateo and Zumalacárregui, 1996 | 50. m/0.32 mm/0.25 μm, He; Program: 40C (10min) => 3C/min => 95C => 10C/min => 270C (10min) |
Capillary | DB-5 | 918. | Mateo and Zumalacárregui, 1996 | 50. m/0.32 mm/0.25 μm, He; Program: 40C (10min) => 3C/min => 95C => 10C/min => 270C (10min) |
Capillary | RSL-150 | 866. | Buchbauer, Nikiforov, et al., 1994 | 60. m/0.32 mm/0.25 μm, He; Program: 30c (1.5min) => 20C/min => 55C => 6C/min => 200C(10min) |
Capillary | SF-96 | 899. | Fagan, Kepner, et al., 1982 | He; Program: not specified |
Capillary | SF-96 | 905. | Fagan, Kepner, et al., 1982 | He; Program: not specified |

Normal alkane RI, polar column, temperature ramp

Column type | Active phase | I | Reference | Comment |
---|---|---|---|---|
Capillary | HP-FFAP | 1666. | Wanakhachornkrai and Lertsiri, 9999 | 25. m/0.32 mm/0.50 μm, Helium, 15. K/min; Tstart: 45. C; Tend: 220. C |
Capillary | HP-FFAP | 1668. | Wanakhachornkrai and Lertsiri, 9999 | 25. m/0.32 mm/0.50 μm, Helium, 15. K/min; Tstart: 45. C; Tend: 220. C |
Capillary | FFAP | 1671. | Budryn, Nebesny, et al., 2011 | 30. m/0.32 mm/0.50 μm, Nitrogen, 35. C @ 5. min, 4. K/min, 250. C @ 45. min |
Capillary | FFAP | 1623. | Piyachaiseth, Jirapakkul, et al., 2011 | 60. m/0.25 mm/0.25 μm, Helium, 45. C @ 1. min, 5. K/min, 220. C @ 5. min |
Capillary | DB-Wax | 1665. | Moon and Shibamoto, 2010 | 60. m/0.25 mm/0.50 μm, Helium, 40. C @ 5. min, 2. K/min, 210. C @ 70. min |
Capillary | DB-Wax | 1662. | Moon and Shibamoto, 2009 | 60. m/0.25 mm/0.50 μm, Helium, 40. C @ 5. min, 2. K/min, 210. C @ 70. min |
Capillary | HP-Innowax | 1651. | Soria, Sanz, et al., 2008 | 50. m/0.20 mm/0.20 μm, Helium, 45. C @ 2. min, 4. K/min, 190. C @ 50. min |
Capillary | FFAP | 1671. | Nebesny, Budryn, et al., 2007 | 30. m/0.32 mm/0.5 μm, N2, 35. C @ 5. min, 4. K/min, 320. C @ 45. min |
Capillary | RTX-Wax | 1631. | Prososki, Etzel, et al., 2007 | 30. m/0.25 mm/0.5 μm, He, 40. C @ 5. min, 10. K/min, 220. C @ 10. min |
Capillary | BP-20 | 1634. | Rawat, Gulati, et al., 2007 | 30. m/0.25 mm/0.25 μm, He, 70. C @ 4. min, 4. K/min, 220. C @ 5. min |
Capillary | Carbowax 20M | 1644. | de la Fuente, Martinez-Castro, et al., 2005 | 50. m/0.25 mm/0.25 μm, Helium, 40. C @ 2. min, 4. K/min, 190. C @ 30. min |
Capillary | DB-Wax | 1626. | Lee, Umano, et al., 2005 | 30. m/0.25 mm/0.25 μm, He, 3. K/min, 180. C @ 40. min; Tstart: 50. C |
Capillary | TC-Wax | 1652. | Ishikawa, Ito, et al., 2004 | 60. m/0.25 mm/0.5 μm, He, 40. C @ 8. min, 3. K/min; Tend: 230. C |
Capillary | HP-Innowax | 1665. | Soria, Gonzalez, et al., 2004 | 50. m/0.2 mm/0.2 μm, He, 45. C @ 2. min, 4. K/min, 190. C @ 50. min |
Capillary | DB-Wax | 1640. | Yanagimoto, Ochi, et al., 2004 | 30. m/0.25 mm/0.25 μm, He, 3. K/min, 180. C @ 40. min; Tstart: 50. C |
Capillary | DB-Wax | 1635. | Lee and Noble, 2003 | 30. m/0.25 mm/0.25 μm, He, 40. C @ 4. min, 4. K/min, 185. C @ 20. min |
Capillary | DB-Wax | 1613. | Lin, Cai, et al., 2003 | 30. m/0.25 mm/0.25 μm, He, 50. C @ 2. min, 3. K/min, 230. C @ 20. min |
Capillary | HP-FFAP | 1668. | Wanakhachornkrai and Lertsiri, 2003 | 25. m/0.32 mm/0.5 μm, He, 15. K/min; Tstart: 45. C; Tend: 220. C |
Capillary | HP-FFAP | 1666. | Wanakhachornkrai and Lertsiri, 2003 | 25. m/0.32 mm/0.5 μm, He, 15. K/min; Tstart: 45. C; Tend: 220. C |
Capillary | DB-Wax | 1608. | Fu, Yoon, et al., 2002 | 30. m/0.25 mm/0.25 μm, He, 40. C @ 5. min, 8. K/min, 250. C @ 5. min |
Capillary | DB-Wax | 1618. | Osorio, Duque, et al., 2002 | 30. m/0.25 mm/0.25 μm, He, 50. C @ 4. min, 4. K/min, 220. C @ 20. min |
Capillary | DB-Wax | 1622. | Osorio, Duque, et al., 2002 | 30. m/0.25 mm/0.25 μm, He, 50. C @ 4. min, 4. K/min, 220. C @ 20. min |
Capillary | HP-Wax | 1673. | Sanz, Maeztu, et al., 2002 | 60. m/0.25 mm/0.5 μm, He, 40. C @ 6. min, 3. K/min; Tend: 190. C |
Capillary | DB-Wax | 1610. | Umano, Hagi, et al., 2002 | 60. m/0.25 mm/0.25 μm, He, 40. C @ 2. min, 2. K/min; Tend: 200. C |
Capillary | HP-Wax | 1673. | Maeztu, Sanz, et al., 2001 | 60. m/0.25 mm/0.5 μm, He, 40. C @ 6. min, 3. K/min; Tend: 190. C |
Capillary | HP-Wax | 1673. | Sanz, Ansorena, et al., 2001 | 60. m/0.25 mm/0.5 μm, He, 40. C @ 6. min, 3. K/min; Tend: 190. C |
Capillary | DB-Wax | 1608. | Wei, Mura, et al., 2001 | 60. m/0.25 mm/0.25 μm, He, 2. K/min; Tstart: 40. C; Tend: 200. C |
Capillary | DB-Wax | 1652. | Lee and Shibamoto, 2000 | 30. m/0.25 mm/0.25 μm, He, 3. K/min, 180. C @ 40. min; Tstart: 50. C |
Capillary | DB-Wax | 1626. | Paniandy, Chane-Ming, et al., 2000 | 60. m/0.32 mm/0.25 μm, Helium, 50. C @ 2. min, 5. K/min; Tend: 230. C |
Capillary | DB-Wax | 1623. | Buttery, Orts, et al., 1999 | 30. C @ 4. min, 2. K/min, 170. C @ 60. min; Column length: 60. m; Column diameter: 0.32 mm |
Capillary | DB-Wax | 1620. | Umano, Nakahara, et al., 1999 | 60. m/0.25 mm/0.25 μm, He, 40. C @ 2. min, 2. K/min; Tend: 200. C |
Capillary | DB-Wax | 1623. | Buttery and Ling, 1998 | 30. C @ 4. min, 2. K/min, 170. C @ 30. min; Column length: 60. m; Column diameter: 0.25 mm |
Capillary | DB-Wax | 1618. | Horiuchi, Umano, et al., 1998 | 60. m/0.25 mm/1. μm, He, 3. K/min, 200. C @ 40. min; Tstart: 50. C |
Capillary | DB-Wax | 1647. | Wada and Shibamoto, 1997 | He, 3. K/min, 200. C @ 40. min; Column length: 60. m; Column diameter: 0.25 mm; Tstart: 50. C |
Capillary | DB-Wax | 1607. | Morales, Albarracín, et al., 1996 | 30. m/0.25 mm/0.25 μm, He, 20. C @ 4. min, 4. K/min, 200. C @ 10. min |
Capillary | DB-Wax | 1600. | Morales, Albarracín, et al., 1996 | 30. m/0.25 mm/0.25 μm, He, 50. C @ 4. min, 4. K/min, 200. C @ 10. min |
Capillary | DB-Wax | 1620. | Umano, Hagi, et al., 1995 | He, 40. C @ 2. min, 2. K/min; Column length: 60. m; Column diameter: 0.25 mm; Tend: 200. C |
Capillary | Carbowax 20M | 1596. | Kawakami, Kobayashi, et al., 1993 | He, 60. C @ 4. min, 2. K/min; Column length: 50. m; Column diameter: 0.25 mm; Tend: 180. C |
Capillary | Carbowax 20M | 1637. | Mihara, Tateba, et al., 1988 | N2, 3. K/min; Column length: 50. m; Column diameter: 0.22 mm; Tstart: 80. C; Tend: 200. C |
Capillary | Carbowax 20M | 1640. | Mihara, Tateba, et al., 1988 | N2, 3. K/min; Column length: 50. m; Column diameter: 0.22 mm; Tstart: 80. C; Tend: 200. C |
Capillary | Carbowax 20M | 1637. | Mihara, Tateba, et al., 1987 | N2, 3. K/min; Column length: 50. m; Column diameter: 0.22 mm; Tstart: 80. C; Tend: 200. C |
Capillary | Carbowax 20M | 1640. | Mihara, Tateba, et al., 1987 | N2, 3. K/min; Column length: 50. m; Column diameter: 0.22 mm; Tstart: 80. C; Tend: 200. C |

Normal alkane RI, polar column, custom temperature program

Column type | Active phase | I | Reference | Comment |
---|---|---|---|---|
Capillary | HP-FFAP | 1646. | Toontom, Meenune, et al., 2012 | 25. m/0.32 mm/0.50 μm, Helium; Program: 45 0C (2 min) 3 0C/min -> 130 0C (1 min) 20 0C/min -> 220 0C (3 min) 20 0C/min -> 230 0C (3 min) |
Capillary | SOLGel-Wax | 1637. | Johanningsmeier and McFeeters, 2011 | 30. m/0.25 mm/0.25 μm, Helium; Program: 40 0C (2 min) 5 0C/min -> 140 0C 10 0C/min -> 250 0C (3 min) |
Capillary | SOLGel-Wax | 1635. | Johanningsmeier and McFeeters, 2011 | 30. m/0.25 mm/0.25 μm, Helium; Program: not specified |
Capillary | Supelko CO Wax | 1660. | Vekiari, Orepoulou, et al., 2010 | 60. m/0.32 mm/0.25 μm, Helium; Program: 40 0C (5 min) 4 0C/min -> 75 0C 5 0C/min -> 250 0C (10 min) |
Capillary | Stabilwax | 1611. | Chinnici, Guerrero, et al., 2009 | 30. m/0.25 mm/0.25 μm, Helium; Program: 35 0C 3 0C/min -> 100 0C 5 0C/min -> 240 0C (10 min) |
Capillary | Supelcowax-10 | 1593. | de Simon, Estruelas, et al., 2009 | 30. m/0.25 mm/0.25 μm, Helium; Program: 45 0C 3 0C/min -> 230 0C (10 min) 10 0C/min -> 270 0C (21 min) |
Capillary | DB-Wax | 1610. | Tao, Wenlai, et al., 2008 | 30. m/0.32 mm/0.25 μm, Helium; Program: 50 0C 20 0C/min -> 80 0C 3 0C/min -> 230 0C |
Capillary | DB-Wax | 1609. | Gonzalez-Rios, Suarez-Quiroz, et al., 2007 | 30. m/0.25 mm/0.25 μm, Hydrogen; Program: 44 0C 3 0C/min -> 170 0C 8 0C/min -> 250 0C |
Capillary | DB-Wax | 1632. | Gonzalez-Rios, Suarez-Quiroz, et al., 2007 | 30. m/0.25 mm/0.25 μm, Hydrogen; Program: not specified |
Capillary | DB-Wax | 1646. | Selli, 2007 | 30. m/0.32 mm/0.50 μm, Hydrogen; Program: 60 0C (3 min) 2 0C/min -> 220 0C 3 0C/min -> 245 0C (20 min) |
Capillary | HP-Innowax | 1652. | Viegas and Bassoli, 2007 | 60. m/0.32 mm/0.25 μm, Helium; Program: 40 0C (5 min) 4 0C/min -> 60 0C (5 min) 8 0C/min -> 250 0C (3 min) |
Capillary | Supelcowax-10 | 1605. | Kourkoutas, Bosnea, et al., 2006 | 60. m/0.32 mm/0.25 μm, He; Program: 35C(3min) => 5C/min => 110C => 10C/min => 240C (10min) |
Capillary | DB-Wax | 1592. | Krings, Zelena, et al., 2006 | 30. m/0.32 mm/0.25 μm, He; Program: 45C(5min) => 5C/min => 150C => 10C/min => 240C (10min) |
Capillary | Carbowax 20M | 1640. | Vinogradov, 2004 | Program: not specified |
Capillary | DB-Wax | 1596. | Selli, Cabaroglu, et al., 2003 | 30. m/0.32 mm/0.5 μm, He; Program: 60C(2min) => 2C/min => 220C => 3C/min => 245C(20min) |
Capillary | HP Innowax FSP | 1651. | Tasdemir, Demirci, et al., 2003 | 60. m/0.25 mm/0.25 μm, He; Program: 60C(10min) => 4C/min => 220C (10min) => 1C/min => 240C |
Capillary | Carbowax 20M | 1601. | Teai, Claude-Lafontaine, et al., 2001 | 50. m/0.2 mm/0.2 μm, N2; Program: 60C => 2C/min => 150C => 4C/min => 220C |
Capillary | Supelcowax-10 | 1632. | Chang, Seitz, et al., 1995 | 30. m/0.32 mm/0.25 μm, He; Program: 50C(2min) => 7C/min => 140C => 17.5C/min => 230C |
Capillary | Supelcowax-10 | 1647. | Miranda-Lopez, Libbey, et al., 1992 | 30. m/0.53 mm/0.25 μm; Program: 80C(5min) => 5C/min => 155C => 4C/min => 240C(30min) |
Capillary | Carbowax 20M | 1625. | Fagan, Kepner, et al., 1982 | He; Column length: 60. m; Column diameter: 0.25 mm; Program: not specified |
Capillary | Carbowax 20M | 1632. | Fagan, Kepner, et al., 1982 | He; Column length: 60. m; Column diameter: 0.25 mm; Program: not specified |

References

Wiberg and Waldron, 1991
Wiberg, K.B.; Waldron, R.F.,
Lactones. 2. Enthalpies of hydrolysis, reduction, and formation of the C4-C13 monocyclic lactones. strain energies and conformations,
J. Am. Chem. Soc., 1991, 113, 7697-7705. [all data]
Leitao, Pilcher, et al., 1990
Leitao, M.L.P.; Pilcher, H.; Meng-Yan, Y.; Brown, J.M.; Conn, A.D.,
Enthalpies of combustion of γ-butyrolactone, γ-valerolactone, and δ-valerolactone,
J. Chem. Thermodyn., 1990, 22, 885-891. [all data]
Brown, Conn, et al., 1989
Brown, J.M.; Conn, A.D.; Pilcher, G.; Leitao, M.L.P.; Yang, M.-Y.,
On the strain energy of 5-ring and 6-ring lactones,
J. Chem. Soc., Chem. Commun., 1989, 1817-1819. [all data]
Steele, Chirico, et al., 1989
Steele, W.V.; Chirico, R.D.; Nguyen, A.; Hossenlopp, I.A.; Smith, N.K.,
Determination of some pure compound ideal-gas enthalpies of formation,
AIChE Symp. Ser., 1989, 85, 140-162. [all data]
Ismailov, Gabzalilova, et al., 1988
Ismailov, T.S.; Gabzalilova, N.R.; Makhkamoov, Kh.M.,
Complex study of physicochemical properties of γ-butyrolactone,
Uzb. Khim. Zh., 1988, 48-50. [all data]
Yevstropov, Lebedev, et al., 1980
Yevstropov, A.A.; Lebedev, B.V.; Kiparisova, Ye.G.; Alekseyev, V.A.; Stashina, G.A.,
Thermodynamic parameters of transformation of γ-butyrolactone into poly-γ-butyrolactone at normal pressure in the range of 0-400°K,
Polym. Sci. USSR, 1980, 22, 2685-2692. [all data]
Kudchadker S.A., 1975
Kudchadker S.A.,
Thermodynamic properties of oxygen compounds. II. beta-Propiolactone, gamma-butyrolactone, and gamma-butyrolactam (2-pyrrolidone),
Thermochim. Acta, 1975, 12, 11-17. [all data]
Lebedev and Yevstropov, 1983
Lebedev, B.V.; Yevstropov, A.A.,
Thermodynamics of β-propiolactone, t-butyrolactone, d-valerolactone, and e-caprolactone from 13.8 to 340 K,
J. Chem. Thermodynam., 1983, 15, 115-128. [all data]
Yevstropov, Lebedev, et al., 1980, 2
Yevstropov, A.A.; Lebedev, B.V.; Kiparisova, Ye.G.; Alekseyev, V.A.; Stashina, G.A.,
Thermodynamic parameters of transformation of t-butyrolactone into poly-t-butyrolactone at normal pressure in the range of 0 to 400 K, Vysokomol. Soedin,
Ser., 1980, A 22(11), 2450-2456. [all data]
Fuchs, 1979
Fuchs, R.,
Heat capacities of some liquid aliphatic, alicyclic, and aromatic esters at 298.15 K,
J. Chem. Thermodyn., 1979, 11, 959-961. [all data]
Aldrich Chemical Company Inc., 1990
Aldrich Chemical Company Inc.,
Catalog Handbook of Fine Chemicals, Aldrich Chemical Company, Inc., Milwaukee WI, 1990, 1. [all data]
Vasil'eva, Naumova, et al., 1990
Vasil'eva, I.I.; Naumova, A.A.; Polyakov, A.A.; Tyvina, T.N.; Kozlova, N.V.,
Vapor pressure and molar volume of liquid tetrahydrofuran, γ- butyrolactone, and dibutyl maleinate at elevated temperatures and pressures,
Zh. Prikl. Khim. (Leningrad), 1990, 63, 1879-81. [all data]
Anonymous, 1954
Anonymous, R.,
, Am. Pet. Inst. Res. Proj. 45, Tech. Rep. 13, Ohio State Univ., 1954. [all data]
Lebedev and Yevstropov, 1983, 2
Lebedev, B.V.; Yevstropov, A.A. (see evstro aa),
Thermodynamics of β-propiolactone, γ-butyrolactone, δ- valerolactone, and ε-caprolactone from 13.8 to 340 K,
J. Chem. Thermodyn., 1983, 15, 115. [all data]
Evstropov, Lebedev, et al., 1980
Evstropov, A.A.; Lebedev, B.V.; Kiparisova, Ye.G.; Alekseev, V.A.; Stashina, G.A.,
Thermodynamic parameters of transformation of τ-butyrolactone into poly-τ-butryrolactone at normal pressure in the range of 0 to 400 K,
Vysokomol. Soedin, Ser. A, 1980, 22, 2450-2456. [all data]
Evstropov, Lebedev, et al., 1979
Evstropov, A.A.; Lebedev, B.V.; Kiparisova, E.G.; Prusakova, I.L.,
Heat capacity and thermodynamic properties of gamma-butyrolactone in the O-330 K range.,
Termodin. Org. Soedin., 1979, No. 8, 14. [all data]
Wilson, Wilson, et al., 1996
Wilson, L.C.; Wilson, H.L.; Wilding, W.V.; Wilson, G.M.,
Critical Point Measurements for Fourteen Compounds by a Static Method and a Flow Method,
J. Chem. Eng. Data, 1996, 41, 1252-4. [all data]
Weast and Grasselli, 1989
CRC Handbook of Data on Organic Compounds, 2nd Editon, Weast,R.C and Grasselli, J.G., ed(s)., CRC Press, Inc., Boca Raton, FL, 1989, 1. [all data]
Stephenson and Malanowski, 1987
Stephenson, Richard M.; Malanowski, Stanislaw,
Handbook of the Thermodynamics of Organic Compounds, 1987, https://doi.org/10.1007/978-94-009-3173-2
. [all data]
Acree, 1991
Acree, William E.,
Thermodynamic properties of organic compounds: enthalpy of fusion and melting point temperature compilation,
Thermochimica Acta, 1991, 189, 1, 37-56, https://doi.org/10.1016/0040-6031(91)87098-H
. [all data]
Hunter and Lias, 1998
Hunter, E.P.; Lias, S.G.,
Evaluated Gas Phase Basicities and Proton Affinities of Molecules: An Update,
J. Phys. Chem. Ref. Data, 1998, 27, 3, 413-656, https://doi.org/10.1063/1.556018
. [all data]
Gerson, Worley, et al., 1978
Gerson, S.H.; Worley, S.D.; Bodor, N.; Kaminski, J.J.; Flechtner, T.W.,
The photoelectron spectra of some heterocyclic compounds which contain N, O, Cl, and Br,
J. Electron Spectrosc. Relat. Phenom., 1978, 13, 421. [all data]
Bain and Frost, 1973
Bain, A.D.; Frost, D.C.,
Studies of the carbonyl group in some five-membered ring compounds by photoelectron spectroscopy,
Can. J. Chem., 1973, 51, 1245. [all data]
Reymond, Mueggler-Chavan, et al., 1966
Reymond, D.; Mueggler-Chavan, F.; Viani, R.; Vuataz, L.; Egli, R.H.,
Gas chromatographic analysis of steam volatile aroma constituents: application to coffee, tea and cocoa aromas,
J. Gas Chromatogr., 1966, 4, 1, 28-31, https://doi.org/10.1093/chromsci/4.1.28
. [all data]
Viani, Müggler-Chavan, et al., 1965
Viani, R.; Müggler-Chavan, F.; Reymond, D.; Egli, R.H.,
196. Sur la composition de l'arôme de café,
Helv. Chim. Acta, 1965, 48, 195-196, 1809-1815, https://doi.org/10.1002/hlca.19650480743
. [all data]
Rembold, Wallner, et al., 1989
Rembold, H.; Wallner, P.; Nitz, S.; Kollmannsberger, H.; Drawert, F.,
Volatile components of chickpea (Cicer arietinum L.) seed,
J. Agric. Food Chem., 1989, 37, 3, 659-662, https://doi.org/10.1021/jf00087a018
. [all data]
Ohnishi and Shibamoto, 1984
Ohnishi, S.; Shibamoto, T.,
Volatile compounds from heated beef fat and beef fat with glycine,
J. Agric. Food Chem., 1984, 32, 5, 987-992, https://doi.org/10.1021/jf00125a008
. [all data]
Tressl, Friese, et al., 1978
Tressl, R.; Friese, L.; Fendesack, F.; Köppler, H.,
Gas chromatographic--mass spectrometric investigation of hop aroma constituents in beer,
J. Agric. Food Chem., 1978, 26, 6, 1422-1426, https://doi.org/10.1021/jf60220a037
. [all data]
Brander, Kepner, et al., 1980
Brander, C.F.; Kepner, R.E.; Webb, A.D.,
Identification of Some Volatile Compounds of Wine of Vitis Vinifera Cultivar Pinot Noir,
Am. J. Enol. Vitic, 1980, 31, 1, 69-75. [all data]
Engel and Ratel, 2007
Engel, E.; Ratel, J.,
Correction of the data generated by mass spectrometry analyses of biological tissues: Application to food authentication,
J. Chromatogr. A, 2007, 1154, 1-2, 331-341, https://doi.org/10.1016/j.chroma.2007.02.012
. [all data]
Quijano, Salamanca, et al., 2007
Quijano, C.E.; Salamanca, G.; Pino, J.A.,
Aroma volatile constituents of Colombian varieties of mango (Mangifera indica L.),
Flavour Fragr. J., 2007, 22, 5, 401-406, https://doi.org/10.1002/ffj.1812
. [all data]
Mahadevan and Farmer, 2006
Mahadevan, K.; Farmer, L.,
Key Odor Impact Compounds in Three Yeast Extract Pastes,
J. Agric. Food Chem., 2006, 54, 19, 7242-7250, https://doi.org/10.1021/jf061102x
. [all data]
Osorio, Alarcon, et al., 2006
Osorio, C.; Alarcon, M.; Moreno, C.; Bonilla, A.; Barrios, J.; Garzon, C.; Duque, C.,
Characterization of Odor-Active Volatiles in Champa ( Campomanesia lineatifolia R. P.),
J. Agric. Food Chem., 2006, 54, 2, 509-516, https://doi.org/10.1021/jf052098c
. [all data]
Pino, Mesa, et al., 2005
Pino, J.A.; Mesa, J.; Muñoz, Y.; Martí, M.P.; Marbot, R.,
Volatile components from mango (Mangifera indica L.) cultivars,
J. Agric. Food Chem., 2005, 53, 6, 2213-2223, https://doi.org/10.1021/jf0402633
. [all data]
Pino, Marbot, et al., 2004
Pino, J.A.; Marbot, R.; Rosado, A.; Vázquez, C.,
Volatile constituents of Malay rose apple [Syzygium malaccense (L.) Merr. Perry],
Flavour Fragr. J., 2004, 19, 1, 32-35, https://doi.org/10.1002/ffj.1269
. [all data]
Pino, Marbot, et al., 2003
Pino, J.; Marbot, R.; Rosado, A.; Vázquez, C.,
Volatile constituents of fruits of Garcinia dulcis Kurz. from Cuba,
Flavour Fragr. J., 2003, 18, 4, 271-274, https://doi.org/10.1002/ffj.1187
. [all data]
Dallüge, van Stee, et al., 2002
Dallüge, J.; van Stee, L.L.P.; Xu, X.; Williams, J.; Beens, J.; Vreuls, R.J.J.; Brinkman, U.A.Th.,
Unravelling the composition of very complex samples by comprehensive gas chromatography coupled to time-of-flight mass spectrometry. Cigarette smoke,
J. Chromatogr. A, 2002, 974, 1-2, 169-184, https://doi.org/10.1016/S0021-9673(02)01384-5
. [all data]
Kim T.H., Kim T.H., et al., 2002
Kim T.H.; Kim T.H.; Shin J.H.; Yu E.J.; Kim Y.S.; Lee H.J.,
Characteristics of aroma-active compounds in the pectin-elicited suspension culture of Zanthoxylum piperitum (prickly ash),
Biotechnology Letters, 2002, 24, 7, 551-556, https://doi.org/10.1023/A:1014812508441
. [all data]
Kim, Shin, et al., 2001
Kim, T.H.; Shin, J.H.; Baek, H.H.; Lee, H.J.,
Volatile flavour compounds in suspension culture of Agastache rugosa Kuntze (Korean mint),
J. Sci. Food Agric., 2001, 81, 6, 569-575, https://doi.org/10.1002/jsfa.845
. [all data]
Wu, Wang, et al., 2000
Wu, C.-M.; Wang, Z.; Wu, Q.H.,
Volatile compounds produced from monosodium glutamate in common food cooking,
J. Agric. Food Chem., 2000, 48, 6, 2438-2442, https://doi.org/10.1021/jf9907743
. [all data]
Lee, DeMilo, et al., 1997
Lee, C.-J.; DeMilo, A.B.; Moreno, D.S.; Mangan, R.L.,
Identification of the volatile components of E802 Mazoferm steepwater, a condensed fermented corn extractive highly attractive to the Mexican fruit fly (Diptera: Tephritidae),
J. Agric. Food Chem., 1997, 45, 6, 2327-2331, https://doi.org/10.1021/jf960632y
. [all data]
Guichard and Souty, 1988
Guichard, E.; Souty, M.,
Comparison of the relative quantities of aroma compounds found in fresh apricot (Prunus armeniaca) from six different varieties,
Z. Lebensm. Unters. Forsch., 1988, 186, 4, 301-307, https://doi.org/10.1007/BF01027031
. [all data]
Botelho, Caldeira, et al., 2007
Botelho, G.; Caldeira, I.; Mendes-Faia, A.; Clímaco, M.C.,
Evaluation of two quantitative gas chromatography-olfactometry methods for clonal red wines differentiation,
Flavour Fragr. J., 2007, 22, 5, 414-420, https://doi.org/10.1002/ffj.1815
. [all data]
Pozo-Bayon M.A., Ruiz-Rodriguez A., et al., 2007
Pozo-Bayon M.A.; Ruiz-Rodriguez A.; Pernin K.; Cayot N.,
Influence of eggs on the aroma composition of a sponge cake and on the aroma release in model studies on flavored sponge cakes,
J. Agric. Food Chem., 2007, 55, 4, 1418-1426, https://doi.org/10.1021/jf062203y
. [all data]
Cho, Choi, et al., 2006
Cho, I.H.; Choi, H.-K.; Kim, Y.-S.,
Difference in the volatile composition of pine-mushrooms (Tricholoma matsutake Sing.) according to their grades,
J. Agric. Food Chem., 2006, 54, 13, 4820-4825, https://doi.org/10.1021/jf0601416
. [all data]
Lee, Lee, et al., 2006
Lee, S.-J.; Lee, J.-E.; Kim, H.-W.; Kim, S.-S.; Koh, K.-H.,
Development of Korean red wines using Vitis labrusca varieties: instrumental and sensory characterization,
Food Chem., 2006, 94, 3, 385-393, https://doi.org/10.1016/j.foodchem.2004.11.035
. [all data]
Fang and Qian, 2005
Fang, Y.; Qian, M.,
Aroma compounds in Oregon Pinot Noir wine determined by aroma extract dilution analysis (AEDA),
Flavour Fragr. J., 2005, 20, 1, 22-29, https://doi.org/10.1002/ffj.1551
. [all data]
Pena, Barciela, et al., 2005
Pena, R.M.; Barciela, J.; Herrero, C.; Garcia-Martin, S.,
Optimization of solid-phase microextraction methods for GC-MS determination of terpenes in wine,
J. Sci. Food Agric., 2005, 85, 7, 1227-1234, https://doi.org/10.1002/jsfa.2121
. [all data]
Chung, Yung, et al., 2002
Chung, H.-Y.; Yung, I.K.S.; Ma, W.C.J.; Kim, J.-S.,
Analysis of volatile components in frozen and dried scallops (Patinopecten yessoensis) by gas chromatography/mass spectrometry,
Food Res. Int., 2002, 35, 1, 43-53, https://doi.org/10.1016/S0963-9969(01)00107-7
. [all data]
Claudela, Dirningera, et al., 2002
Claudela, P.; Dirningera, N.; Etievant, P.,
Effects of water on gas chromatographic column efficiency measurements applied to on-column injections of volatile aroma compounds,
J. Sep. Sci., 2002, 25, 5-6, 365-370, https://doi.org/10.1002/1615-9314(20020401)25:5/6<365::AID-JSSC365>3.0.CO;2-Y
. [all data]
Chung, Yung, et al., 2001
Chung, H.Y.; Yung, I.K.S.; Kim, J.-S.,
Comparison of volatile components in dried scallops (Chlamys farreri and Patinopecten yessoensis) prepared by boiling and steaming methods,
J. Agric. Food Chem., 2001, 49, 1, 192-202, https://doi.org/10.1021/jf000692a
. [all data]
Charles, Martin, et al., 2000
Charles, M.; Martin, B.; Ginies, C.; Etievant, P.; Coste, G.; Guichard, E.,
Potent aroma compounds of two red wine vinegars,
J. Agric. Food Chem., 2000, 48, 1, 70-77, https://doi.org/10.1021/jf9905424
. [all data]
Chung, 2000
Chung, H.Y.,
Volatile flavor components in red fermented soybean (Glycine max) curds,
J. Agric. Food Chem., 2000, 48, 5, 1803-1809, https://doi.org/10.1021/jf991272s
. [all data]
Chevance and Farmer, 1999
Chevance, F.F.V.; Farmer, L.J.,
Release of volatile odor compounds from full-fat and reduced-fat frankfurters,
J. Agric. Food Chem., 1999, 47, 12, 5161-5168, https://doi.org/10.1021/jf9905166
. [all data]
Umano, Hagi, et al., 1992
Umano, K.; Hagi, Y.; Nakahara, K.; Shoji, A.; Shibamoto, T.,
Volatile constituents of green and ripened pineapple (Aanas comosus [L.] Merr.),
J. Agric. Food Chem., 1992, 40, 4, 599-603, https://doi.org/10.1021/jf00016a014
. [all data]
Baltes and Mevissen, 1988
Baltes, W.; Mevissen, L.,
Model reactions on roast aroma formation. VI. Volatile reaction products from the reaction of phenylalanine with glucose during cooking and roasting,
Z. Lebensm. Unters. Forsch., 1988, 187, 3, 209-214, https://doi.org/10.1007/BF01043341
. [all data]
Bianchi, Careri, et al., 2007
Bianchi, F.; Careri, M.; Mangia, A.; Musci, M.,
Retention indices in the analysis of food aroma volatile compounds in temperature-programmed gas chromatography: Database creation and evaluation of precision and robustness,
J. Sep. Sci., 2007, 39, 4, 563-572, https://doi.org/10.1002/jssc.200600393
. [all data]
Natali N., Chinnici F., et al., 2006
Natali N.; Chinnici F.; Riponi C.,
Characterization of volatiles in extracts from oak chips obtained by accelerated solvent extraction (ASE),
J. Agric. Food Chem., 2006, 54, 21, 8190-8198, https://doi.org/10.1021/jf0614387
. [all data]
Selli, Canbas, et al., 2006
Selli, S.; Canbas, A.; Cabaroglu, T.; Erten, H.; Gunata, Z.,
Aroma components of cv. Muscat of Bornova wines and influence of skin contact treatment,
Food Chem., 2006, 94, 3, 319-326, https://doi.org/10.1016/j.foodchem.2004.11.019
. [all data]
Selli, Canbas, et al., 2006, 2
Selli, S.; Canbas, A.; Cabaroglu, T.; Erten, H.; Lepoutre, J.-P.; Gunata, Z.,
Effect of skin contact on the free and bound aroma compounds of the white wine of Vitis vinifera L. cv Narince,
Food Control, 2006, 17, 1, 75-82, https://doi.org/10.1016/j.foodcont.2004.09.005
. [all data]
Selli, Cabaroglu, et al., 2004
Selli, S.; Cabaroglu, T.; Canbas, A.; Erten, H.; Nurgel, C.; Lepoutre, J.P.; Gunata, Z.,
Volatile composition of red wine from cv. Kalecik Karasi grown in central Anatolia,
Food Chem., 2004, 85, 2, 207-213, https://doi.org/10.1016/j.foodchem.2003.06.008
. [all data]
Boido, Lloret, et al., 2003
Boido, E.; Lloret, A.; Medina, K.; Fariña, L.; Carrau, f.; Versini, G.; Dellacassa, E.,
Aroma composition of Vitis vinifera Cv. Tannat: the typical red wine from Uruguay,
J. Agric. Food Chem., 2003, 51, 18, 5408-5413, https://doi.org/10.1021/jf030087i
. [all data]
Cantergiani, Brevard, et al., 2001
Cantergiani, E.; Brevard, H.; Krebs, Y.; Feria-Morales, A.; Amadò, R.; Yeretzian, C.,
Characterisation of the aroma of green Mexican coffee and identification of mouldy/earthy defect,
Eur. Food Res. Technol., 2001, 212, 6, 648-657, https://doi.org/10.1007/s002170100305
. [all data]
Radovic, Careri, et al., 2001
Radovic, B.S.; Careri, M.; Mangia, A.; Musci, M.; Gerboles, M.; Anklam, E.,
Analytical, nutritional, and clinical methods section. Contribution of dynamic headspace GC-MS analysis of aroma compounds to authenticity testing of honey,
Food Chem., 2001, 72, 4, 511-520, https://doi.org/10.1016/S0308-8146(00)00263-6
. [all data]
Baltes w. and Bochmann G., 1987
Baltes w.; Bochmann G.,
Model reactions on roast aroma formation. II. Mass spectrometric identification of furans and furanones from the reaction of serine and threonine with sucrose under the conditions of coffee roasting,
Z. Lebensm. Unters. Forsch., 1987, 184, 179-186. [all data]
Whitfield, Shea, et al., 1981
Whitfield, F.B.; Shea, S.R.; Gillen, K.J.; Shaw, K.J.,
Volatile components from the roots of Acacia pulchella R.Br. and their effect on Phytophthora cinnamomi rands,
Aust. J. Bot., 1981, 29, 2, 195-208, https://doi.org/10.1071/BT9810195
. [all data]
Anderson, 1968
Anderson, D.G.,
USe of Kovats retention indices and response factors for the qualitative and quantitative analysis of coating solvents,
J. Paint Technol., 1968, 40, 527, 549-557. [all data]
Leffingwell and Alford, 2011
Leffingwell, J.; Alford, E.D.,
Volatile constituents of the giant pufball mushroom (Calvatia gigantea),
Leffingwell Rep., 2011, 4, 1-17. [all data]
Piyachaiseth, Jirapakkul, et al., 2011
Piyachaiseth, T.; Jirapakkul, W.; Chaiseri, S.,
Aroma compounds of flash-fried rice,
Kasetsart J. (Nat. Sci.), 2011, 45, 717-729. [all data]
Risticevic, Carasek, et al., 2008
Risticevic, S.; Carasek, E.; Pawliszyn, J.,
Headspace solid-phase microextraction-gas chromatographic-time-of-flight mass spectrometric methodology for geographical origin verification of coffee,
Anal. Chim. Acta, 2008, 617, 1-2, 72-84, https://doi.org/10.1016/j.aca.2008.04.009
. [all data]
Ramirez R. and Cava R., 2007
Ramirez R.; Cava R.,
Volatile profiles of dry-cured meat products from three different Iberian x Duroc genotypes,
J. Agric. Food Chem., 2007, 55, 5, 1923-1931, https://doi.org/10.1021/jf062810l
. [all data]
Vasta, Ratel, et al., 2007
Vasta, V.; Ratel, J.; Engel, E.,
Mass Spectrometry Analysis of Volatile Compounds in Raw Meat for the Authentication of the Feeding Background of Farm Animals,
J. Agric. Food Chem., 2007, 55, 12, 4630-4639, https://doi.org/10.1021/jf063432n
. [all data]
Kim, Abd El-Aty, et al., 2006
Kim, M.R.; Abd El-Aty, A.M.; Kim, I.S.; Shim, J.H.,
Determination of volatile flavor components in danggui cultivars by solvent free injection and hydrodistillation followed by gas chromatographic-mass spectrometric analysis,
J. Chromatogr. A, 2006, 1116, 1-2, 259-264, https://doi.org/10.1016/j.chroma.2006.03.060
. [all data]
Dickschat, Bode, et al., 2005
Dickschat, J.S.; Bode, H.B.; Wenzel, S.C.; Muller, R.; Schulz, S.,
Biosinthesis and Identification of Volatiles Released by the Myxobacterium Stigmatella aurantiaca,
ChemBioChem, 2005, 6, 11, 2023-2033, https://doi.org/10.1002/cbic.200500174
. [all data]
Leffingwell and Alford, 2005
Leffingwell, J.C.; Alford, E.D.,
Volatile constituents of Perique tobacco,
Electron. J. Environ. Agric. Food Chem., 2005, 4, 2, 899-915. [all data]
Pino, Marbot, et al., 2003, 2
Pino, J.A.; Marbot, R.; Fuentes, V.,
Characterization of volatiles in Bullock's heart (Annona reticulata L.) fruit cultivars from Cuba,
J. Agric. Food Chem., 2003, 51, 13, 3836-3839, https://doi.org/10.1021/jf020733y
. [all data]
Sebastian, Viallon-Fernandez, et al., 2003
Sebastian, I.; Viallon-Fernandez, C.; Berge, P.; Berdague, J.-L.,
Analysis of the volatile fraction of lamb fat tissue: influence of the type of feeding,
Sciences des Aliments, 2003, 23, 4, 497-511, https://doi.org/10.3166/sda.23.497-511
. [all data]
Chen and Ho, 1999
Chen, J.; Ho, C.-T.,
Comparison of volatile generation in serine/threonine/glutamine-ribose/glucose/fructose model systems,
J. Agric. Food Chem., 1999, 47, 2, 643-647, https://doi.org/10.1021/jf980771a
. [all data]
Jung, Wichmann, et al., 1999
Jung, A.; Wichmann, K.-H.; Kolb, M.,
VOC emission of polymeric packaging materials,
LaborPraxis, 1999, 23, 9, 20-22. [all data]
King, Hamilton, et al., 1993
King, M.-F.; Hamilton, B.L.; Matthews, M.A.; Rule, D.C.; Field, R.A.,
Isolation and identification of volatiles and condensable material in raw beef with supercritical carbon dioxide extraction,
J. Agric. Food Chem., 1993, 41, 11, 1974-1981, https://doi.org/10.1021/jf00035a030
. [all data]
Georgilopoulos and Gallois, 1988
Georgilopoulos, D.N.; Gallois, A.N.,
Flavour compounds of a commercial concentrated blackberry juice,
Food Chem., 1988, 28, 2, 141-148, https://doi.org/10.1016/0308-8146(88)90143-4
. [all data]
Habu, Flath, et al., 1985
Habu, T.; Flath, R.A.; Mon, T.R.; Morton, J.F.,
Volatile components of Rooibos tea (Aspalathus linearis),
J. Agric. Food Chem., 1985, 33, 2, 249-254, https://doi.org/10.1021/jf00062a024
. [all data]
del Rosario, de Lumen, et al., 1984
del Rosario, R.; de Lumen, B.O.; Habu, T.; Flath, R.A.; Mon, T.R.; Teranishi, R.,
Comparison of headspace volatiles from winged beans and soybeans,
J. Agric. Food Chem., 1984, 32, 5, 1011-1015, https://doi.org/10.1021/jf00125a015
. [all data]
Mondello, 2012
Mondello, L.,
HS-SPME-GCxGC-MS analysis of Yerba Mate (Ilex paraguariensis)
in Shimadzu GC-GC application compendium of comprehensive 2D GC, Vol. 1-5, Shimadzu Corp., 2012, 1-29. [all data]
VOC BinBase, 2012
VOC BinBase,
The volatile compound BinBase (VOC BinBase), 2012, retrieved from http://fiehnlab.ucdavis.edu/projects/VocBinBase and http://binbase.sourceforge.net. [all data]
Skogerson, Wohlgemuth, et al., 2011
Skogerson, K.; Wohlgemuth, G.; Fiehn, O.,
VocBinNase, 2011, retrieved from http://fiehnlab.ucdavis.edu/projects//VocBinBase. [all data]
de Simon, Estruelas, et al., 2009
de Simon, B.F.; Estruelas, E.; Munoz, A.M.; Cadahia, E.; Sanz, M.,
Volatile compounds in acacia, chestnut, cherry, ash, and oak woods, with a view to their use in cooperage,
J. Agric. Food Chem., 2009, 57, 8, 3217-3227, https://doi.org/10.1021/jf803463h
. [all data]
Ventanas, Estevez, et al., 2008
Ventanas, S.; Estevez, M.; Andres, A.I.; Ruiz, J.,
Analysis of volatile compounds of Iberian dry-cured loins with different intramuscular fat contents using SPME-DED,
Meat Sci., 2008, 79, 1, 172-180, https://doi.org/10.1016/j.meatsci.2007.08.011
. [all data]
Liu, Xu, et al., 2007
Liu, Y.; Xu, X.-L.; Zhou, G.-H.,
Comparative study of volatile compounds in traditional Chinese Nanjing marinated duck by different extraction techniques,
Int. J. Food Sci. Technol., 2007, 42, 5, 543-550, https://doi.org/10.1111/j.1365-2621.2006.01264.x
. [all data]
Pino, Marbot, et al., 2005
Pino, J.A.; Marbot, R.; Rosado, A.; Vázquez, C.,
Volatile constituents of Malay rose apple [Syzygium malaccense (L.) Merr. Perry],
Flavour Fragr. J., 2005, 20, 98-100. [all data]
Garcia-Estaban, Ansorena, et al., 2004
Garcia-Estaban, M.; Ansorena, D.; Astiasaran, I.; Martin, D.; Ruiz, J.,
Comparison of simultaneous distillation extraction (SDE) and solid-phase microextraction (SPME) for the analysis of volatile compounds in dry-cured ham,
J. Sci. Food Agric., 2004, 84, 11, 1364-1370, https://doi.org/10.1002/jsfa.1826
. [all data]
Begnaud, Pérès, et al., 2003
Begnaud, F.; Pérès, C.; Berdagué, J.-L.,
Characterization of volatile effluents of livestock buildings by solid-phase microextraction,
Int. J. Environ. Anal. Chem., 2003, 83, 10, 837-849, https://doi.org/10.1080/03067310310001603349
. [all data]
Jordán, Margaría, et al., 2003
Jordán, M.J.; Margaría, C.A.; Shaw, P.E.; Goodner, K.L.,
Volatile components and aroma active compounds in aqueous essence and fresh pink guava fruid puree (Psidium guajava L.) by GC-MS and multidimensional GC/GC-O,
J. Agric. Food Chem., 2003, 51, 5, 1421-1426, https://doi.org/10.1021/jf020765l
. [all data]
Jordán, Goodner, et al., 2002
Jordán, M.J.; Goodner, K.L.; Shaw, P.E.,
Characterization of the aromatic profile in aqueous essence and fruit juice of yellow passion fruit (Passiflora edulis Sims F. Flavicarpa degner) by GC-MS and GC/O,
J. Agric. Food Chem., 2002, 50, 6, 1523-1528, https://doi.org/10.1021/jf011077p
. [all data]
Jordán, Margaría, et al., 2002
Jordán, M.J.; Margaría, C.A.; Shaw, P.E.; Goodner, K.L.,
Aroma active components in aqueous kiwi fruit essence and kiwi fruit puree by GC-MS and multidimensional GC/GC-O,
J. Agric. Food Chem., 2002, 50, 19, 5386-5390, https://doi.org/10.1021/jf020297f
. [all data]
Ansorena, Gimeno, et al., 2001
Ansorena, D.; Gimeno, O.; Astiasarán, I.; Bello, J.,
Analysis of volatile compounds by GC-MS of a dry fermented sausage: chorizo de Pamplona,
Food Res. Int., 2001, 34, 1, 67-75, https://doi.org/10.1016/S0963-9969(00)00133-2
. [all data]
Mateo, Aguirrezábal, et al., 1997
Mateo, J.; Aguirrezábal, M.; Domínguez, C.; Zumalacárregui, J.M.,
Volatile compounds in Spanish paprika,
J. Food Comp. Anal., 1997, 10, 3, 225-232, https://doi.org/10.1006/jfca.1997.0535
. [all data]
Mateo and Zumalacárregui, 1996
Mateo, J.; Zumalacárregui, J.M.,
Volatile compounds in chorizo and their changes during ripening,
Meat Sci., 1996, 44, 4, 255-273, https://doi.org/10.1016/S0309-1740(96)00028-9
. [all data]
Buchbauer, Nikiforov, et al., 1994
Buchbauer, G.; Nikiforov, A.; Remberg, B.,
Headspace constituents of opium,
Planta Medica, 1994, 60, 2, 181-183, https://doi.org/10.1055/s-2006-959447
. [all data]
Fagan, Kepner, et al., 1982
Fagan, G.L.; Kepner, R.E.; Webb, A.D.,
Additional volatile components of Palomino film sherry,
Am. J. Enol. Vitic, 1982, 33, 1, 47-50. [all data]
Wanakhachornkrai and Lertsiri, 9999
Wanakhachornkrai, P.; Lertsiri, S.,
Comparison of determination method for volatile compounds in Thai soy sauce,
Analytical, Nutritional and Clinical Methods, 9999, 1-11. [all data]
Budryn, Nebesny, et al., 2011
Budryn, G.; Nebesny, E.; Kula, J.; Majda, T.; Krysiak, W.,
HS-SPME/GC/MS Profiles of convectively and microwave roasted Ivory Coast Robusta coffee brews,
Czech. J. Food Sci., 2011, 29, 2, 151-160. [all data]
Moon and Shibamoto, 2010
Moon, J.-K.; Shibamoto, T.,
Formation of volatile chemicals from thermal degradation of less volatile cofee components: quinic acid, caffeic acid, and chlorogenic acid,
J. Agric. Food Chem., 2010, 58, 9, 5465-5470, https://doi.org/10.1021/jf1005148
. [all data]
Moon and Shibamoto, 2009
Moon, J.-K.; Shibamoto, T.,
Role of roasting conditions in the profile of volatile flavor chemicals formed from coffee beans,
J. Agric. Food Chem., 2009, 57, 13, 5823-5831, https://doi.org/10.1021/jf901136e
. [all data]
Soria, Sanz, et al., 2008
Soria, A.C.; Sanz, J.; Martinez-Castro, I.,
SPME followed by GC-MS: a powerful technique for qualitative analysis of honey volatiles,
Eur. Food Res. Technol., 2008, 1-12. [all data]
Nebesny, Budryn, et al., 2007
Nebesny, E.; Budryn, G.; Kula, J.; Majda, T.,
The effect of roasting method on headspace composition of robusta coffee bean aroma,
Eur. Food Res. Technol., 2007, 225, 1, 9-19, https://doi.org/10.1007/s00217-006-0375-0
. [all data]
Prososki, Etzel, et al., 2007
Prososki, R.A.; Etzel, M.R.; Rankin, S.A.,
Solvent type affects the number, distribution, and relative quantities of volatile compounds found in sweet whey powder,
J. Dairy Sci., 2007, 90, 2, 523-531, https://doi.org/10.3168/jds.S0022-0302(07)71535-7
. [all data]
Rawat, Gulati, et al., 2007
Rawat, R.; Gulati, A.; Babu, G.D.K.; Acharya, R.; Kaul, V.K.; Singh, B.,
Characterization of volatile components of Kangra orthodox black tea by gas chromatography-mass spectrometry,
Food Chem., 2007, 105, 1, 229-235, https://doi.org/10.1016/j.foodchem.2007.03.071
. [all data]
de la Fuente, Martinez-Castro, et al., 2005
de la Fuente, E.; Martinez-Castro, I.; Sanz, J.,
Characterization of Spanish unifloral honeys by solid phase microextraction and gas chromatography-mass spectrometry,
J. Sep. Sci., 2005, 28, 9-10, 1093-1100, https://doi.org/10.1002/jssc.200500018
. [all data]
Lee, Umano, et al., 2005
Lee, S.-J.; Umano, K.; Shibamoto, T.; Lee, K.-G.,
Identification of volatile components in basil (Ocimum basilicum L.) and thyme leaves (Thymus vulgaris L.) and their antioxidant properties,
Food Chem., 2005, 91, 1, 131-137, https://doi.org/10.1016/j.foodchem.2004.05.056
. [all data]
Ishikawa, Ito, et al., 2004
Ishikawa, M.; Ito, O.; Ishizaki, S.; Kurobayashi, Y.; Fujita, A.,
Solid-phase aroma concentrate extraction (SPACE ): a new headspace technique for more sensitive analysis of volatiles,
Flavour Fragr. J., 2004, 19, 3, 183-187, https://doi.org/10.1002/ffj.1322
. [all data]
Soria, Gonzalez, et al., 2004
Soria, A.C.; Gonzalez, M.; de Lorenzo, C.; Martinez-Castro, I.; Sanza, J.,
Characterization of artisanal honeys from Madrid (Central Spain) on the basis of their melissopalynological, physicochemical and volatile composition data,
Food Chem., 2004, 85, 1, 121-130, https://doi.org/10.1016/j.foodchem.2003.06.012
. [all data]
Yanagimoto, Ochi, et al., 2004
Yanagimoto, K.; Ochi, H.; Lee, K.-G.; Shibamoto, T.,
Antioxidative activities of fractions obtained from brewed coffee,
J. Agric. Food Chem., 2004, 52, 3, 592-596, https://doi.org/10.1021/jf030317t
. [all data]
Lee and Noble, 2003
Lee, S.-J.; Noble, A.C.,
Characterization of odor-active compounds in Californian Chardonnay wines using GC-olfactometry and GC-mass spectrometry,
J. Agric. Food Chem., 2003, 51, 27, 8036-8044, https://doi.org/10.1021/jf034747v
. [all data]
Lin, Cai, et al., 2003
Lin, P.; Cai, J.; Li, J.; Sang, W.; Su, Q.,
Constituents of the essential oil of Hemerocallis flava day lily,
Flavour Fragr. J., 2003, 18, 6, 539-541, https://doi.org/10.1002/ffj.1264
. [all data]
Wanakhachornkrai and Lertsiri, 2003
Wanakhachornkrai, P.; Lertsiri, S.,
Analytical, nutritional, and clinical methods. Comparison of determination method for volatile compounds in Thai soy sauce,
Food Chem., 2003, 83, 4, 619-629, https://doi.org/10.1016/S0308-8146(03)00256-5
. [all data]
Fu, Yoon, et al., 2002
Fu, S.-G.; Yoon, Y.; Basemore, R.,
Aroma-actie components in fermented bamboo shoots,
J. Agric. Food Chem., 2002, 50, 3, 549-554, https://doi.org/10.1021/jf010883t
. [all data]
Osorio, Duque, et al., 2002
Osorio, C.; Duque, C.; Suarez, M.; Salamanca, L.E.; Uruena, F.,
Free, glycosidically bound, and phosphate bound flavor constituents of badea (Passiflora quadrangularis) fruit pulp,
J. Sep. Sci., 2002, 25, 3, 147-154, https://doi.org/10.1002/1615-9314(20020201)25:3<147::AID-JSSC147>3.0.CO;2-G
. [all data]
Sanz, Maeztu, et al., 2002
Sanz, C.; Maeztu, L.; Zapelena, M.J.; Bello, J.; Cid, C.,
Profiles of volatile compounds and sensory analysis of three blends of coffee: influence of different proportions of Arabica and Robusta and influence of roasting coffee with sugar,
J. Sci. Food Agric., 2002, 82, 8, 840-847, https://doi.org/10.1002/jsfa.1110
. [all data]
Umano, Hagi, et al., 2002
Umano, K.; Hagi, Y.; Shibamoto, T.,
Volatile chemicals identified in extracts from newly hybrid citrus, dekopon (Shiranuhi mandarin Suppl. J.),
J. Agric. Food Chem., 2002, 50, 19, 5355-5359, https://doi.org/10.1021/jf0203951
. [all data]
Maeztu, Sanz, et al., 2001
Maeztu, L.; Sanz, C.; Andueza, S.; de Peña, M.P.; Bello, J.; Cid, C.,
Characterization of espresso coffee aroma by static headspace GC-MS and sensory flavor profile,
J. Agric. Food Chem., 2001, 49, 11, 5437-5444, https://doi.org/10.1021/jf0107959
. [all data]
Sanz, Ansorena, et al., 2001
Sanz, C.; Ansorena, D.; Bello, J.; Cid, C.,
Optimizing headspace temperature and time sampling for identification of volatile compounds in ground roasted Arabica coffee,
J. Agric. Food Chem., 2001, 49, 3, 1364-1369, https://doi.org/10.1021/jf001100r
. [all data]
Wei, Mura, et al., 2001
Wei, A.; Mura, K.; Shibamoto, T.,
Antioxidative activity of volatile chemicals extracted from beer,
J. Agric. Food Chem., 2001, 49, 8, 4097-4101, https://doi.org/10.1021/jf010325e
. [all data]
Lee and Shibamoto, 2000
Lee, K.-G.; Shibamoto, T.,
Antioxidant properties of aroma compounds isolated from soybeans and mung beans,
J. Agric. Food Chem., 2000, 48, 9, 4290-4293, https://doi.org/10.1021/jf000442u
. [all data]
Paniandy, Chane-Ming, et al., 2000
Paniandy, J.-C.; Chane-Ming, J.; Pierbattesti, J.-C.,
Chemical Composition of the Essential Oil and Headspace Solid-Phase Microextraction of the Guava Fruit (Psidium guajava L.),
J. Essent. Oil Res., 2000, 12, 153-158. [all data]
Buttery, Orts, et al., 1999
Buttery, R.G.; Orts, W.J.; Takeoka, G.R.; Nam, Y.,
Volatile flavor components of rice cakes,
J. Agric. Food Chem., 1999, 47, 10, 4353-4356, https://doi.org/10.1021/jf990140w
. [all data]
Umano, Nakahara, et al., 1999
Umano, K.; Nakahara, K.; Shoji, A.; Shibamoto, T.,
Aroma chemicals isolated and identified from leaves of aloe arborescens Mill. Var. natalensis Berger,
J. Agric. Food Chem., 1999, 47, 9, 3702-3705, https://doi.org/10.1021/jf990116i
. [all data]
Buttery and Ling, 1998
Buttery, R.G.; Ling, L.C.,
Additional studies on flavor components of corn tortilla chips,
J. Agric. Food Chem., 1998, 46, 7, 2764-2769, https://doi.org/10.1021/jf980125b
. [all data]
Horiuchi, Umano, et al., 1998
Horiuchi, M.; Umano, K.; Shibamoto, T.,
Analysis of volatile compounds formed from fish oil heated with cysteine and trimethylamine oxide,
J. Agric. Food Chem., 1998, 46, 12, 5232-5237, https://doi.org/10.1021/jf980482m
. [all data]
Wada and Shibamoto, 1997
Wada, K.; Shibamoto, T.,
Isolation and identification of volatile compounds from a wine using solid phase extraction, gas chromatography, and gas chromatography/mass spectrometry,
J. Agric. Food Chem., 1997, 45, 11, 4362-4366, https://doi.org/10.1021/jf970157j
. [all data]
Morales, Albarracín, et al., 1996
Morales, A.L.; Albarracín, D.; Rodríguez, J.; Duque, C.; Riaño, L.E.; Espitia, J.,
Volatile constituents from Andes berry (Rubus glaucus Benth),
J. Hi. Res. Chromatogr., 1996, 19, 10, 585-587, https://doi.org/10.1002/jhrc.1240191011
. [all data]
Umano, Hagi, et al., 1995
Umano, K.; Hagi, Y.; Nakahara, K.; Shyoji, A.; Shibamoto, T.,
Volatile chemicals formed in the headspace of a heated D-glucose/L-cysteine Maillard model system,
J. Agric. Food Chem., 1995, 43, 8, 2212-2218, https://doi.org/10.1021/jf00056a046
. [all data]
Kawakami, Kobayashi, et al., 1993
Kawakami, M.; Kobayashi, A.; Kator, K.,
Volatile constituents of Rooibos tea (Aspalathus linearis) as affected by extraction process,
J. Agric. Food Chem., 1993, 41, 4, 633-636, https://doi.org/10.1021/jf00028a023
. [all data]
Mihara, Tateba, et al., 1988
Mihara, S.; Tateba, H.; Nishimura, O.; Machii, Y.; Kishino, K.,
The volatile components of Chinese quince (Pseudocydonia sinensis Schneid)
in Flavors and Fragrances: A World Perspective. Proceedings of the 10th International Congress of Essential Oils, Fragrances and Flavors, Lawrence,B.M.; Mookherjee,B.D.; Willis,B.J., ed(s)., Elsevier, New York, 1988, 537-550. [all data]
Mihara, Tateba, et al., 1987
Mihara, S.; Tateba, H.; Nishimura, O.; Machii, Y.; Kishino, K.,
Volatile components of Chinese quince (Pseudocydonia sinensis Schneid),
J. Agric. Food Chem., 1987, 35, 4, 532-537, https://doi.org/10.1021/jf00076a023
. [all data]
Toontom, Meenune, et al., 2012
Toontom, N.; Meenune, M.; Posri, W.; Lertsiri, S.,
Effect of drying method on physical and chemical quality, hotness and volatile flavour characteristics of dried chili,
Int. Food Res. J., 2012, 19, 3, 1023-1031. [all data]
Johanningsmeier and McFeeters, 2011
Johanningsmeier, S.D.; McFeeters, R.F.,
Detection of volatile spoilage metabolites in fermented cucumbers using nontargeted, comprehensive 2-dimensional gas chromatography-time-of-flight mass spectrometry (GCxGCxTOFMS),
J. Food Sci., 2011, 76, 1, c168-c177, https://doi.org/10.1111/j.1750-3841.2010.01918.x
. [all data]
Vekiari, Orepoulou, et al., 2010
Vekiari, S.A.; Orepoulou, V.; Kourkoutas, Y.; Kamoun, N.; Msallem, M.; Psimouli, V.; Arapoglou, D.,
Characterization and seasonal variations of the quality of virgin olive oil of the Thoumbolia and Koroneiki varieties from Southern Greece,
Grasas y Aceites, 2010, 61, 3, 221-231, https://doi.org/10.3989/gya.108709
. [all data]
Chinnici, Guerrero, et al., 2009
Chinnici, F.; Guerrero, E.D.; Sonni, F.; Natali, N.; Marin, R.N.; Riponi, C.,
Gas chromatography - mass spectrometry (GC-MS) characterization of volatile compounds in quality vinegars with protected Europian geographical indication,
J. Agric. Food Chem., 2009, 57, 11, 4784-4792, https://doi.org/10.1021/jf804005w
. [all data]
Tao, Wenlai, et al., 2008
Tao, L.; Wenlai, F.; Yan, X.,
Characterization of volatile and semi-volatile compounds in Chinese rica wines by headspace solid phase microextraction followed by gas chromatography - mass spectrometry,
J. Inst. Brew., 2008, 114, 2, 172-179, https://doi.org/10.1002/j.2050-0416.2008.tb00323.x
. [all data]
Gonzalez-Rios, Suarez-Quiroz, et al., 2007
Gonzalez-Rios, O.; Suarez-Quiroz, M.L.; Boulanger, R.; Barel, M.; Guyot, B.; Guiraud, J.-P.; Schorr-Galindo, S.,
Impact of ecological post-harvest processing of coffee aroma: II Roasted coffee.,
J. Food Composition Analysis, 2007, 20, 3-4, 297-307, https://doi.org/10.1016/j.jfca.2006.12.004
. [all data]
Selli, 2007
Selli, S.,
Volatile constituents of orange obtained from moro oranges (Citrus Sinensis L. Osbeck),
J. Food Quality, 2007, 30, 3, 330-341, https://doi.org/10.1111/j.1745-4557.2007.00124.x
. [all data]
Viegas and Bassoli, 2007
Viegas, M.C.; Bassoli, D.G.,
Utilizacao do indice de retencao linear para caracterizacao de compostos volateis em cafe soluvel utilizando GC-MS e coluna HP-Innowax,
Quim. Nova, 2007, 30, 8, 2031-2034, https://doi.org/10.1590/S0100-40422007000800040
. [all data]
Kourkoutas, Bosnea, et al., 2006
Kourkoutas, Y.; Bosnea, L.; Taboukos, S.; Baras, C.; Lambrou, D.; Kanellaki, M.,
Probiotic Cheese Production Using Lactobacillus casei Cells Immobilized on Fruit Pieces,
J. Dairy Sci., 2006, 89, 5, 1439-1451, https://doi.org/10.3168/jds.S0022-0302(06)72212-3
. [all data]
Krings, Zelena, et al., 2006
Krings, U.; Zelena, K.; Wu, S.; Berger, R.G.,
Thin-layer high-vacuum distillation to isolate volatile flavour compounds of cocoa powder,
Eur. Food Res. Technol., 2006, 223, 5, 675-681, https://doi.org/10.1007/s00217-006-0252-x
. [all data]
Vinogradov, 2004
Vinogradov, B.A.,
Production, composition, properties and application of essential oils, 2004, retrieved from http://viness.narod.ru. [all data]
Selli, Cabaroglu, et al., 2003
Selli, s.; Cabaroglu, T.; Canbas, A.,
Flavour components of orange wine made from a Turkish cv. Kozan,
Int. J. Food Sci. Technol., 2003, 38, 5, 587-593, https://doi.org/10.1046/j.1365-2621.2003.00691.x
. [all data]
Tasdemir, Demirci, et al., 2003
Tasdemir, D.; Demirci, B.; Demirci, F.; Dönmez, A.A.; Baser, K.H.C.; Rüedi, P.,
Analysis of the Volatile Components of Five Turkish Rhododendron Species by Headspace Solid-Phase Microextraction and GC-MS (HS-SPME-GC-MS),
Z. Naturforsch., 2003, 58c, 797-803. [all data]
Teai, Claude-Lafontaine, et al., 2001
Teai, T.; Claude-Lafontaine, A.; Schippa, C.; Cozzolino, F.,
Volatile compounds in fresh pulp of pineapple (Ananas comosus [L.] Merr.) from French Polynesia,
J. Essent. Oil Res., 2001, 13, 5, 314-318, https://doi.org/10.1080/10412905.2001.9712222
. [all data]
Chang, Seitz, et al., 1995
Chang, C.-Y.; Seitz, L.M.; Chambers, E., IV,
Volatile Flavor Components of Breads Made from Hard Red Winter Wheat and Hard White Winter Wheat,
Cereal Chem., 1995, 72, 3, 237-242. [all data]
Miranda-Lopez, Libbey, et al., 1992
Miranda-Lopez, R.; Libbey, L.M.; Watson, B.T.; McDaniel, M.R.,
Odor analysis of Pinot noir wines from grapes of different maturities by a gas chromatography-olfactometry technique (Osme),
J. Food Sci., 1992, 57, 4, 985-993, https://doi.org/10.1111/j.1365-2621.1992.tb14339.x
. [all data]