Cyclopentanol
- Formula: C5H10O
- Molecular weight: 86.1323
- IUPAC Standard InChIKey: XCIXKGXIYUWCLL-UHFFFAOYSA-N
- CAS Registry Number: 96-41-3
- Chemical structure:
View 3d structure (requires JavaScript / HTML 5) - Other names: Cyclopentyl alcohol; Hydroxycyclopentane; UN 2244

Gas phase thermochemistry data

Data compiled as indicated in comments:
DRB - Donald R. Burgess, Jr.
ALS - Hussein Y. Afeefy, Joel F. Liebman, and Stephen E. Stein
GT - Glushko Thermocenter, Russian Academy of Sciences, Moscow
Quantity | Value | Units | Method | Reference | Comment |
---|---|---|---|---|---|
ΔfH°gas | -243.0 | kJ/mol | N/A | Wiberg, Wasserman, et al., 1985 | Value computed using ΔfHliquid° value of -300.4±1.0 kj/mol from Wiberg, Wasserman, et al., 1985 and ΔvapH° value of 57.4 kj/mol from Sellers and Sunner, 1962.; DRB |
ΔfH°gas | -242.6 ± 1.7 | kJ/mol | Ccb | Sellers and Sunner, 1962 | Reanalyzed by Cox and Pilcher, 1970, Original value = -241.1 kJ/mol; ALS |
ΔfH°gas | -242.9 | kJ/mol | N/A | Parks, Mosley, et al., 1950 | Value computed using ΔfHliquid° value of -300.3±0.2 kj/mol from Parks, Mosley, et al., 1950 and ΔvapH° value of 57.4 kj/mol from Sellers and Sunner, 1962.; DRB |
Constant pressure heat capacity of gas
Cp,gas (J/mol*K) | Temperature (K) | Reference | Comment |
---|---|---|---|
105.43 | 298.15 | Kabo G.J., 1995 | Selected thermodynamic functions were calculated so that statistical entropy value at 340 K was put into agreement with the experimental one by adjusting the pseudorotational moment of inertia. Statistically calculated S(T) and Cp(T) values given in [ Thermodynamics Research Center, 1997] are 2-13 and 7-9 J/mol*K, respectively, larger than those of [ Kabo G.J., 1995].; GT |
106.09 | 300. | ||
142.01 | 400. | ||
174.02 | 500. | ||
200.71 | 600. | ||
222.75 | 700. | ||
241.29 | 800. | ||
257.00 | 900. | ||
270.39 | 1000. |

Condensed phase thermochemistry data

Data compiled as indicated in comments:
ALS - Hussein Y. Afeefy, Joel F. Liebman, and Stephen E. Stein
DH - Eugene S. Domalski and Elizabeth D. Hearing
Quantity | Value | Units | Method | Reference | Comment |
---|---|---|---|---|---|
ΔfH°liquid | -300.4 ± 1.0 | kJ/mol | Cac | Wiberg, Wasserman, et al., 1985 | Trifluoroacetolysis; ALS |
ΔfH°liquid | -300.0 ± 1.7 | kJ/mol | Ccb | Sellers and Sunner, 1962 | Reanalyzed by Cox and Pilcher, 1970, Original value = -298.6 kJ/mol; ALS |
ΔfH°liquid | -300.3 ± 0.2 | kJ/mol | Ccb | Parks, Mosley, et al., 1950 | ALS |
Quantity | Value | Units | Method | Reference | Comment |
ΔcH°liquid | -3096.7 ± 1.7 | kJ/mol | Ccb | Sellers and Sunner, 1962 | Reanalyzed by Cox and Pilcher, 1970, Original value = -3098.1 ± 0.84 kJ/mol; Corresponding ΔfHºliquid = -300.0 kJ/mol (simple calculation by NIST; no Washburn corrections); ALS |
ΔcH°liquid | -3096.5 ± 1.5 | kJ/mol | Ccb | Parks, Mosley, et al., 1950 | Corresponding ΔfHºliquid = -300.2 kJ/mol (simple calculation by NIST; no Washburn corrections); ALS |
Quantity | Value | Units | Method | Reference | Comment |
S°liquid | 206.3 | J/mol*K | N/A | Parks, Kennedy, et al., 1956 | Extrapolation below 80 K, 48.79 J/mol*K.; DH |
Constant pressure heat capacity of liquid
Cp,liquid (J/mol*K) | Temperature (K) | Reference | Comment |
---|---|---|---|
181.57 | 298.15 | Benson and D'Arcy, 1986 | DH |
185.4 | 298. | Conti, Gianni, et al., 1976 | DH |
181.57 | 298.15 | Conti, Gianni, et al., 1976 | DH |
184.14 | 298.15 | Parks, Kennedy, et al., 1956 | T = 80 to 300 K.; DH |

Phase change data

Data compiled as indicated in comments:
BS - Robert L. Brown and Stephen E. Stein
TRC - Thermodynamics Research Center, NIST Boulder Laboratories, Chris Muzny director
AC - William E. Acree, Jr., James S. Chickos
ALS - Hussein Y. Afeefy, Joel F. Liebman, and Stephen E. Stein
DRB - Donald R. Burgess, Jr.
CAL - James S. Chickos, William E. Acree, Jr., Joel F. Liebman, Students of Chem 202 (Introduction to the Literature of Chemistry), University of Missouri -- St. Louis
DH - Eugene S. Domalski and Elizabeth D. Hearing
Quantity | Value | Units | Method | Reference | Comment |
---|---|---|---|---|---|
Tboil | 413. ± 2. | K | AVG | N/A | Average of 10 values; Individual data points |
Quantity | Value | Units | Method | Reference | Comment |
Tfus | 254.15 | K | N/A | Timmermans, 1952 | Uncertainty assigned by TRC = 1. K; TRC |
Tfus | 253. | K | N/A | White and Bishop, 1940 | Crystal phase 1 phase; Uncertainty assigned by TRC = 2. K; TRC |
Quantity | Value | Units | Method | Reference | Comment |
Ttriple | 255.6 | K | N/A | Kabo, Diky, et al., 1995 | Crystal phase 1 phase; Uncertainty assigned by TRC = 0.3 K; TRC |
Ttriple | 256.0 | K | N/A | Wuerflinger and Kreutzenbeck, 1978 | Crystal phase 1 phase; Uncertainty assigned by TRC = 0.5 K; TRC |
Ttriple | 257.4 | K | N/A | Parks, Kennedy, et al., 1956, 2 | Crystal phase 1 phase; Uncertainty assigned by TRC = 0.2 K; see 1978 wuekre 0 for phase identification; TRC |
Quantity | Value | Units | Method | Reference | Comment |
Tc | 620. ± 1. | K | N/A | Gude and Teja, 1995 | |
Tc | 619.5 | K | N/A | Ambrose and Ghiassee, 1987 | Uncertainty assigned by TRC = 1. K; TRC |
Quantity | Value | Units | Method | Reference | Comment |
Pc | 49. ± 1. | bar | N/A | Gude and Teja, 1995 | |
Pc | 49.00 | bar | N/A | Ambrose and Ghiassee, 1987 | Uncertainty assigned by TRC = 1.00 bar; TRC |
Quantity | Value | Units | Method | Reference | Comment |
ΔvapH° | 57. ± 1. | kJ/mol | AVG | N/A | Average of 8 values; Individual data points |
Enthalpy of vaporization
ΔvapH (kJ/mol) | Temperature (K) | Method | Reference | Comment |
---|---|---|---|---|
52.7 | 361. | A,EB | Ambrose and Ghiassee, 1987, 2 | Based on data from 346. to 437. K.; AC |
57.1 | 294. | N/A | Cabani, Conti, et al., 1975 | Based on data from 279. to 314. K.; AC |
Enthalpy of fusion
ΔfusH (kJ/mol) | Temperature (K) | Reference | Comment |
---|---|---|---|
1.54 | 257.4 | Domalski and Hearing, 1996 | AC |
Entropy of fusion
ΔfusS (J/mol*K) | Temperature (K) | Reference | Comment |
---|---|---|---|
18.28 | 202.8 | Domalski and Hearing, 1996 | CAL |
5.98 | 257.4 |
Enthalpy of phase transition
ΔHtrs (kJ/mol) | Temperature (K) | Initial Phase | Final Phase | Reference | Comment |
---|---|---|---|---|---|
3.707 | 202.8 | crystaline, II | crystaline, I | Parks, Kennedy, et al., 1956 | DH |
1.536 | 257.4 | crystaline, I | liquid | Parks, Kennedy, et al., 1956 | DH |
Entropy of phase transition
ΔStrs (J/mol*K) | Temperature (K) | Initial Phase | Final Phase | Reference | Comment |
---|---|---|---|---|---|
18.28 | 202.8 | crystaline, II | crystaline, I | Parks, Kennedy, et al., 1956 | DH |
5.97 | 257.4 | crystaline, I | liquid | Parks, Kennedy, et al., 1956 | DH |

Reaction thermochemistry data

Data compiled as indicated in comments:
B - John E. Bartmess
ALS - Hussein Y. Afeefy, Joel F. Liebman, and Stephen E. Stein
Individual Reactions
C5H9O- + =
By formula: C5H9O- + H+ = C5H10O
Quantity | Value | Units | Method | Reference | Comment |
---|---|---|---|---|---|
ΔrH° | 1602. ± 19. | kJ/mol | D-EA | Alconcel and Continetti, 2002 | gas phase; derived acidity seems ca. 10 kcal/mol too weak, and EA likewise; B |
Quantity | Value | Units | Method | Reference | Comment |
ΔrG° | 1535. ± 4.6 | kJ/mol | N/A | Garver, Yang, et al., 2011 | gas phase; B |
ΔrG° | 1569. ± 20. | kJ/mol | H-TS | Alconcel and Continetti, 2002 | gas phase; derived acidity seems ca. 10 kcal/mol too weak, and EA likewise; B |
By formula: C5H8O + H2 = C5H10O
Quantity | Value | Units | Method | Reference | Comment |
---|---|---|---|---|---|
ΔrH° | -60.25 ± 0.67 | kJ/mol | Cm | Wiberg, Crocker, et al., 1991 | liquid phase; ALS |
ΔrH° | -51.25 ± 0.63 | kJ/mol | Chyd | Conn, Kistiakowsky, et al., 1939 | gas phase; Reanalyzed by Cox and Pilcher, 1970, Original value = -52.3 ± 0.3 kJ/mol; At 355 K; ALS |
By formula: C4F6O3 + C5H10O = C7H9F3O2 + C2HF3O2
Quantity | Value | Units | Method | Reference | Comment |
---|---|---|---|---|---|
ΔrH° | -92.96 ± 0.23 | kJ/mol | Cac | Wiberg, Wasserman, et al., 1985 | liquid phase; solvent: Trifluoroactic acid; Trifluoroacetolysis; ALS |
By formula: C5H10O = C5H8O + H2
Quantity | Value | Units | Method | Reference | Comment |
---|---|---|---|---|---|
ΔrH° | 54.9 ± 4.7 | kJ/mol | Eqk | Fedoseenko, Yursha, et al., 1984 | gas phase; ALS |
ΔrH° | 51.30 | kJ/mol | Eqk | Cubberley and Mueller, 1946 | gas phase; ALS |
By formula: C6H10O + C5H10O = C6H12O + C5H8O
Quantity | Value | Units | Method | Reference | Comment |
---|---|---|---|---|---|
ΔrH° | -11.6 ± 1.7 | kJ/mol | Eqk | Fedoseenko, Yursha, et al., 1984 | gas phase; ALS |

Gas phase ion energetics data

Data compiled as indicated in comments:
B - John E. Bartmess
MM - Michael M. Meot-Ner (Mautner)
LBLHLM - Sharon G. Lias, John E. Bartmess, Joel F. Liebman, John L. Holmes, Rhoda D. Levin, and W. Gary Mallard
LLK - Sharon G. Lias, Rhoda D. Levin, and Sherif A. Kafafi
RDSH - Henry M. Rosenstock, Keith Draxl, Bruce W. Steiner, and John T. Herron
Proton affinity at 298K
Proton affinity (kJ/mol) | Reference | Comment |
---|---|---|
798. ± 6. | Cao and Holmes, 2001 | MM |
Ionization energy determinations
IE (eV) | Method | Reference | Comment |
---|---|---|---|
9.72 | PI | Traeger, 1985 | LBLHLM |
9.58 ± 0.06 | EI | Holmes, Yuan, et al., 1977 | LLK |
Appearance energy determinations
Ion | AE (eV) | Other Products | Method | Reference | Comment |
---|---|---|---|---|---|
C3H5O+ | 9.72 | C2H5 | PI | Traeger, 1985 | LBLHLM |
C3H6O+ | 9.98 | C2H4 | EI | Holmes and Lossing, 1980 | LLK |
C5H8+ | 9.66 ± 0.06 | H2O | EI | Holmes, Yuan, et al., 1977 | LLK |
C5H8+ | 9.49 | H2O | EI | Lewis and Hamill, 1970 | RDSH |
H2O+ | 13.23 | C5H8 | EI | Lewis and Hamill, 1970 | RDSH |
De-protonation reactions
C5H9O- + =
By formula: C5H9O- + H+ = C5H10O
Quantity | Value | Units | Method | Reference | Comment |
---|---|---|---|---|---|
ΔrH° | 1602. ± 19. | kJ/mol | D-EA | Alconcel and Continetti, 2002 | gas phase; derived acidity seems ca. 10 kcal/mol too weak, and EA likewise; B |
Quantity | Value | Units | Method | Reference | Comment |
ΔrG° | 1535. ± 4.6 | kJ/mol | N/A | Garver, Yang, et al., 2011 | gas phase; B |
ΔrG° | 1569. ± 20. | kJ/mol | H-TS | Alconcel and Continetti, 2002 | gas phase; derived acidity seems ca. 10 kcal/mol too weak, and EA likewise; B |

Kovats' RI, non-polar column, isothermal

Column type | Active phase | Temperature (C) | I | Reference | Comment |
---|---|---|---|---|---|
Packed | SE-30 | 100. | 792. | Winskowski, 1983 | Gaschrom Q; Column length: 2. m |
Packed | Apiezon L | 120. | 768. | Bogoslovsky, Anvaer, et al., 1978 | Celite 545 |
Packed | Apiezon L | 160. | 781. | Bogoslovsky, Anvaer, et al., 1978 | Celite 545 |
Packed | Apiezon L | 130. | 768. | Bogoslovsky, Anvaer, et al., 1978 | |
Packed | DC-200 | 100. | 782. | Rohrschneider, 1966 | Column length: 4. m |
Packed | Apiezon L | 100. | 767. | Rohrschneider, 1966 | Column length: 5. m |
Packed | Apiezon L | 130. | 768. | Wehrli and Kováts, 1959 | Celite; Column length: 2.25 m |
Packed | Apiezon L | 190. | 773. | Wehrli and Kováts, 1959 | Celite; Column length: 2.25 m |

Kovats' RI, polar column, isothermal

Column type | Active phase | Temperature (C) | I | Reference | Comment |
---|---|---|---|---|---|
Packed | Carbowax 20M | 100. | 1298. | Rohrschneider, 1966 | Column length: 2. m |

Kovats' RI, polar column, temperature ramp

Column type | Active phase | I | Reference | Comment |
---|---|---|---|---|
Capillary | Carbowax 20M | 1283. | Nishimura, Yamaguchi, et al., 1989 | 2. K/min; Column length: 50. m; Column diameter: 0.22 mm; Tstart: 80. C; Tend: 200. C |

Van Den Dool and Kratz RI, non-polar column, custom temperature program

Column type | Active phase | I | Reference | Comment |
---|---|---|---|---|
Capillary | DB-5 | 765. | Boulanger, Chassagne, et al., 1999 | 30. m/0.25 mm/0.25 μm, H2; Program: 40C(5min) => 2C/min => 220C => 5C/min => 250C(15min) |
Capillary | DB-5 | 781. | Boulanger, Chassagne, et al., 1999 | 30. m/0.25 mm/0.25 μm, H2; Program: 40C(5min) => 2C/min => 220C => 5C/min => 250C(15min) |
Capillary | DB-5 | 765. | Boulanger, Chassagne, et al., 1999 | 30. m/0.25 mm/0.25 μm, H2; Program: 40C(5min) => 2C/min => 220C => 5C/min => 250C(15min) |
Capillary | DB-5 | 781. | Boulanger, Chassagne, et al., 1999 | 30. m/0.25 mm/0.25 μm, H2; Program: 40C(5min) => 2C/min => 220C => 5C/min => 250C(15min) |
Capillary | Methyl Silicone | 774. | Peng, Yang, et al., 1991 | Program: not specified |
Packed | SE-30 | 774. | Peng, Ding, et al., 1988 | Supelcoport; Chromosorb; Column length: 3.05 m; Program: 40C(5min) => 10C/min => 200C or 250C (60min) |

Van Den Dool and Kratz RI, polar column, temperature ramp

Column type | Active phase | I | Reference | Comment |
---|---|---|---|---|
Capillary | DB-Wax | 1300. | Fernandez-Segovia, Escriche, et al., 2006 | 30. m/0.25 mm/0.25 μm, He, 50. C @ 5. min, 10. K/min, 230. C @ 25. min |
Capillary | Supelcowax-10 | 1314. | Chung, Yung, et al., 2002 | 60. m/0.25 mm/0.25 μm, He, 35. C @ 5. min, 2. K/min, 195. C @ 90. min |
Capillary | Supelcowax-10 | 1314. | Chung, Yung, et al., 2001 | 60. m/0.25 mm/0.25 μm, He, 35. C @ 5. min, 2. K/min, 195. C @ 90. min |
Capillary | DB-Wax | 1309. | Beauchene, Grua-Priol, et al., 2000 | 60. m/0.32 mm/0.5 μm, He, 3. K/min, 160. C @ 5. min; Tstart: 30. C |
Capillary | DB-Wax | 1323. | Iwaoka, Hagi, et al., 1994 | He, 40. C @ 5. min, 2. K/min; Column length: 30. m; Column diameter: 0.25 mm; Tend: 200. C |
Capillary | DB-Wax | 1278. | Fröhlich, Duque, et al., 1989 | 30. m/0.25 mm/0.25 μm, He, 50. C @ 3. min, 4. K/min; Tend: 250. C |
Capillary | DB-Wax | 1281. | Fröhlich, Duque, et al., 1989 | 30. m/0.25 mm/0.25 μm, He, 50. C @ 3. min, 4. K/min; Tend: 250. C |

Normal alkane RI, non-polar column, isothermal

Column type | Active phase | Temperature (C) | I | Reference | Comment |
---|---|---|---|---|---|
Packed | Apieson L | 120. | 795. | Kurdina, Markovich, et al., 1969 | not specified, not specified |

Normal alkane RI, non-polar column, temperature ramp

Column type | Active phase | I | Reference | Comment |
---|---|---|---|---|
Capillary | OV-101 | 802. | Anker, Jurs, et al., 1990 | 2. K/min; Column length: 50. m; Column diameter: 0.28 mm; Tstart: 80. C; Tend: 200. C |

Normal alkane RI, non-polar column, custom temperature program

Column type | Active phase | I | Reference | Comment |
---|---|---|---|---|
Capillary | SE-30 | 805. | Vinogradov, 2004 | Program: not specified |
Capillary | OV-1, SE-30, Methyl silicone, SP-2100, OV-101, DB-1, etc. | 792. | Waggott and Davies, 1984 | Hydrogen; Column length: 50. m; Column diameter: 0.32 mm; Program: not specified |

Normal alkane RI, polar column, temperature ramp

Column type | Active phase | I | Reference | Comment |
---|---|---|---|---|
Capillary | ZB-Wax | 1328. | Wierda R.L., Fletcher G., et al., 2006 | 60. m/0.32 mm/0.5 μm, He, 40. C @ 2. min, 3. K/min, 250. C @ 10. min |
Capillary | DB-Wax | 1300. | Fu, Yoon, et al., 2002 | 30. m/0.25 mm/0.25 μm, He, 40. C @ 5. min, 8. K/min, 250. C @ 5. min |
Capillary | TC-Wax | 1290. | Fukami, Ishiyama, et al., 2002 | 60. m/0.25 mm/0.25 μm, He, 2. K/min; Tstart: 50. C; Tend: 230. C |
Capillary | DB-Wax | 1303. | Umano, Nakahara, et al., 1999 | 60. m/0.25 mm/0.25 μm, He, 40. C @ 2. min, 2. K/min; Tend: 200. C |
Capillary | Carbowax 20M | 1283. | Anker, Jurs, et al., 1990 | 2. K/min; Column length: 80. m; Column diameter: 0.2 mm; Tstart: 70. C; Tend: 170. C |
Capillary | Carbowax 20M | 1289. | Mihara, Tateba, et al., 1988 | N2, 3. K/min; Column length: 50. m; Column diameter: 0.22 mm; Tstart: 80. C; Tend: 200. C |
Capillary | Carbowax 20M | 1292. | Mihara, Tateba, et al., 1988 | N2, 3. K/min; Column length: 50. m; Column diameter: 0.22 mm; Tstart: 80. C; Tend: 200. C |
Capillary | Carbowax 20M | 1289. | Mihara, Tateba, et al., 1987 | N2, 3. K/min; Column length: 50. m; Column diameter: 0.22 mm; Tstart: 80. C; Tend: 200. C |
Capillary | Carbowax 20M | 1292. | Mihara, Tateba, et al., 1987 | N2, 3. K/min; Column length: 50. m; Column diameter: 0.22 mm; Tstart: 80. C; Tend: 200. C |

Normal alkane RI, polar column, custom temperature program

Column type | Active phase | I | Reference | Comment |
---|---|---|---|---|
Capillary | DB-Wax | 1323. | Sampaio, Garruti, et al., 2011 | 30. m/0.25 mm/0.25 μm, Hydrogen; Program: 35 0C (9 min) 5 0C/min -> 80 0C 1 0C/min -> 100 0C 16 0C/min -> 210 0C (20 min) |
Capillary | DB-Wax | 1339. | Yongsheng, Hua, et al., 2008 | 30. m/0.32 mm/0.25 μm, Helium; Program: 40 0C (4 min) 3 0C/min -> 50 0C 5 0C/min -> 120 0C 7 0C/min -> 175 0C 10 0C/min -> 230 0C (8 min) |
Capillary | HP-Innowax | 1280. | Quijano and Pino, 2006 | 60. m/0.25 mm/0.25 μm, Nitrogen; Program: 50 0C (4 min) -> 40 0C 4 0C/min -> 220 0C |
Capillary | Carbowax 20M | 1283. | Vinogradov, 2004 | Program: not specified |
Capillary | DB-Wax | 1327. | Piveteau, le Guen, et al., 2000 | 60. m/0.32 mm/0.5 μm, He; Program: 50C(6min) => 1C/min => 130C => 10C/min => 240C (15min) |
Capillary | DB-Wax | 1297. | Peng, Yang, et al., 1991, 2 | Program: not specified |
Capillary | DB-Wax | 1327. | Peng, Yang, et al., 1991, 2 | Program: not specified |

References

Wiberg, Wasserman, et al., 1985
Wiberg, K.B.; Wasserman, D.J.; Martin, E.J.; Murcko, M.A.,
Enthalpies of hydration of alkenes. 3. Cycloalkenes,
J. Am. Chem. Soc., 1985, 107, 6019-6022. [all data]
Sellers and Sunner, 1962
Sellers, P.; Sunner, S.,
Heats of combustion of cyclic ketones and alcohols,
Acta Chem. Scand., 1962, 16, 46-52. [all data]
Cox and Pilcher, 1970
Cox, J.D.; Pilcher, G.,
Thermochemistry of Organic and Organometallic Compounds, Academic Press, New York, 1970, 1-636. [all data]
Parks, Mosley, et al., 1950
Parks, G.S.; Mosley, J.R.; Peterson, P.V., Jr.,
Heats of combustion and formation of some organic compounds containing oxygen,
J. Chem. Phys., 1950, 18, 152. [all data]
Kabo G.J., 1995
Kabo G.J.,
Thermodynamic properties, conformation, and phase transitions of cyclopentanol,
J. Chem. Thermodyn., 1995, 27, 953-967. [all data]
Thermodynamics Research Center, 1997
Thermodynamics Research Center,
Selected Values of Properties of Chemical Compounds., Thermodynamics Research Center, Texas A&M University, College Station, Texas, 1997. [all data]
Parks, Kennedy, et al., 1956
Parks, G.S.; Kennedy, W.D.; Gates, R.R.; Mosley, J.R.; Moore, G.E.; Renquist, M.L.,
Thermal data on organic compounds. XXVI. Some heat capacity, entropy and free energy data for seven compounds containing oxygen.,
Not In System, 1956, 78, 56-59. [all data]
Benson and D'Arcy, 1986
Benson, G.C.; D'Arcy, P.J.,
Excess isobaric heat capacities of some binary mixtures: (a C5-alkanol + n-heptane) at 298.15 K,
J. Chem. Thermodynam., 1986, 18, 493-498. [all data]
Conti, Gianni, et al., 1976
Conti, G.; Gianni, P.; Matteoli, E.; Mengheri, M.,
Capacita termiche molari di alcuni composti organici mono- e bifunzionali nel liquido puro e in soluzione acquosa a 25C,
Chim. Ind. (Milan), 1976, 58, 225. [all data]
Timmermans, 1952
Timmermans, J.,
Freezing points of organic compounds. VVI New determinations.,
Bull. Soc. Chim. Belg., 1952, 61, 393. [all data]
White and Bishop, 1940
White, A.H.; Bishop, W.S.,
Dielectric Evidence of Molecular Rotation in the Crystals of Certain Non-aromatic Compounds,
J. Am. Chem. Soc., 1940, 62, 8-16. [all data]
Kabo, Diky, et al., 1995
Kabo, G.Ya.; Diky, V.V.; Kozyro, A.A.; Krasulin, A.P.; Sevruk, V.M.,
Thermodynamic properties, conformational composition, and phase transitions of cyclopentanol,
J. Chem. Thermodyn., 1995, 27, 953-67. [all data]
Wuerflinger and Kreutzenbeck, 1978
Wuerflinger, A.; Kreutzenbeck, J.,
J. Phys. Chem. Solids, 1978, 39, 193. [all data]
Parks, Kennedy, et al., 1956, 2
Parks, G.S.; Kennedy, W.D.; Gates, R.R.; Mosley, J.R.; Moore, G.E.; Renquist, M.L.,
Thermal Data on Organic Compounds XXVI. Some Heat Capacity, Entropy and Free Energy Data for Seven Compounds Containing Oxygen,
J. Am. Chem. Soc., 1956, 78, 56-9. [all data]
Gude and Teja, 1995
Gude, M.; Teja, A.S.,
Vapor-Liquid Critical Properties of Elements and Compounds. 4. Aliphatic Alkanols,
J. Chem. Eng. Data, 1995, 40, 1025-1036. [all data]
Ambrose and Ghiassee, 1987
Ambrose, D.; Ghiassee, N.B.,
Vapor Pressures and Critical Temperatures and Critical Pressures of C5 and C6 Cyclic Alcohols and Ketones,
J. Chem. Thermodyn., 1987, 19, 903. [all data]
Ambrose and Ghiassee, 1987, 2
Ambrose, D.; Ghiassee, N.B.,
Vapour pressures and critical temperatures and critical pressures of C5 and C6 cyclic alcohols and ketones,
The Journal of Chemical Thermodynamics, 1987, 19, 9, 903-909, https://doi.org/10.1016/0021-9614(87)90036-X
. [all data]
Cabani, Conti, et al., 1975
Cabani, Sergio; Conti, G.; Mollica, V.; Lepori, L.,
Thermodynamic study of dilute aqueous solutions of organic compounds. Part 4.---Cyclic and straight chain secondary alcohols,
J. Chem. Soc., Faraday Trans. 1, 1975, 71, 0, 1943, https://doi.org/10.1039/f19757101943
. [all data]
Domalski and Hearing, 1996
Domalski, Eugene S.; Hearing, Elizabeth D.,
Heat Capacities and Entropies of Organic Compounds in the Condensed Phase. Volume III,
J. Phys. Chem. Ref. Data, 1996, 25, 1, 1, https://doi.org/10.1063/1.555985
. [all data]
Alconcel and Continetti, 2002
Alconcel, L.S.; Continetti, R.E.,
Dissociation dynamics and stability of cyclopentoxy and cyclopentoxide,
Chem. Phys. Lett., 2002, 366, 5-6, 642-649, https://doi.org/10.1016/S0009-2614(02)01633-0
. [all data]
Garver, Yang, et al., 2011
Garver, J.M.; Yang, Z.B.; Kato, S.; Wren, S.W.; Vogelhuber, K.M.; Lineberger, W.C.; Bierbaum, V.M.,
Gas Phase Reactions of 1,3,5-Triazine: Proton Transfer, Hydride Transfer, and Anionic sigma-Adduct Formation,
J. Am. Soc. Mass Spectrom., 2011, 22, 7, 1260-1272, https://doi.org/10.1007/s13361-011-0133-9
. [all data]
Wiberg, Crocker, et al., 1991
Wiberg, K.B.; Crocker, L.S.; Morgan, K.M.,
Thermochemical studies of carbonyl compounds. 5. Enthalpies of reduction of carbonyl groups,
J. Am. Chem. Soc., 1991, 113, 3447-3450. [all data]
Conn, Kistiakowsky, et al., 1939
Conn, J.B.; Kistiakowsky, G.B.; Smith, E.A.,
Heats of organic reactions. VIII. Some further hydrogenations, including those of some acetylenes,
J. Am. Chem. Soc., 1939, 61, 1868-1876. [all data]
Fedoseenko, Yursha, et al., 1984
Fedoseenko, V.I.; Yursha, I.A.; Kabo, G.Ya.,
Equilibrium of cyclopentanol dehydrogenation and hydrogen disproportionation in the cyclopentanol-cyclohexanone system,
Dokl. Akad. Nauk BSSR, 1984, 28, 1109-1112. [all data]
Cubberley and Mueller, 1946
Cubberley, A.H.; Mueller, M.B.,
Equilibrium studies on the dehydrogenation of primary and secondary alcohols. I. 2-Butanol, 2-octanol, cyclopentanol and benzyl alcohol,
J. Am. Chem. Soc., 1946, 68, 1149-1151. [all data]
Cao and Holmes, 2001
Cao, J.; Holmes, J.L.,
Determination of the proton affinities of secondary alcohols from the dissocation of proton-bound molecular trios,
European J. Mass Spectrom., 2001, 7, 243-247. [all data]
Traeger, 1985
Traeger, J.C.,
Heat of formation for the propanoyl cation by photoionization mass spectrometry,
Org. Mass Spectrom., 1985, 20, 223. [all data]
Holmes, Yuan, et al., 1977
Holmes, J.L.; Yuan, D.; Rye, R.T.B.,
Metastable ion studies VII-Loss of water from the molecular ion of cyclopentanol,
Org. Mass Spectrom., 1977, 12, 254. [all data]
Holmes and Lossing, 1980
Holmes, J.L.; Lossing, F.P.,
Gas-phase heats of formation of keto and enol ions of carbonyl compounds.,
J. Am. Chem. Soc., 1980, 102, 1591. [all data]
Lewis and Hamill, 1970
Lewis, D.; Hamill, W.H.,
Excited states of neutral molecular fragments from appearance potentials by electron impact in a mass spectrometer,
J. Chem. Phys., 1970, 52, 6348. [all data]
Winskowski, 1983
Winskowski, J.,
Gaschromatographische Identifizierung von Stoffen anhand von Indexziffem und unterschiedlichen Detektoren,
Chromatographia, 1983, 17, 3, 160-165, https://doi.org/10.1007/BF02271041
. [all data]
Bogoslovsky, Anvaer, et al., 1978
Bogoslovsky, Yu.N.; Anvaer, B.I.; Vigdergauz, M.S.,
Chromatographic constants in gas chromatography (in Russian), Standards Publ. House, Moscow, 1978, 192. [all data]
Rohrschneider, 1966
Rohrschneider, L.,
Eine methode zur charakterisierung von gaschromatographischen trennflüssigkeiten,
J. Chromatogr., 1966, 22, 6-22, https://doi.org/10.1016/S0021-9673(01)97064-5
. [all data]
Wehrli and Kováts, 1959
Wehrli, A.; Kováts, E.,
Gas-chromatographische Charakterisierung ogranischer Verbindungen. Teil 3: Berechnung der Retentionsindices aliphatischer, alicyclischer und aromatischer Verbindungen,
Helv. Chim. Acta, 1959, 7, 7, 2709-2736, https://doi.org/10.1002/hlca.19590420745
. [all data]
Nishimura, Yamaguchi, et al., 1989
Nishimura, O.; Yamaguchi, K.; Mihara, S.; Shibamoto, T.,
Volatile Constituents of Guava Fruits (Psidium guajava L.) and Canned Puree,
J. Agric. Food Chem., 1989, 37, 1, 139-142, https://doi.org/10.1021/jf00085a033
. [all data]
Boulanger, Chassagne, et al., 1999
Boulanger, R.; Chassagne, D.; Crouzet, J.,
Free and bound flavour components of amazonian fruits. 1: Bacuri,
Flavour Fragr. J., 1999, 14, 5, 303-311, https://doi.org/10.1002/(SICI)1099-1026(199909/10)14:5<303::AID-FFJ834>3.0.CO;2-C
. [all data]
Peng, Yang, et al., 1991
Peng, C.T.; Yang, Z.C.; Maltby, D.,
Prediction of retention indexes. III. Silylated derivatives of polar compounds,
J. Chromatogr., 1991, 586, 1, 113-129, https://doi.org/10.1016/0021-9673(91)80029-G
. [all data]
Peng, Ding, et al., 1988
Peng, C.T.; Ding, S.F.; Hua, R.L.; Yang, Z.C.,
Prediction of Retention Indexes I. Structure-Retention Index Relationship on Apolar Columns,
J. Chromatogr., 1988, 436, 137-172, https://doi.org/10.1016/S0021-9673(00)94575-8
. [all data]
Fernandez-Segovia, Escriche, et al., 2006
Fernandez-Segovia, I.; Escriche, I.; Gomez-Sintes, M.; Fuentes, A.; Serra, J.A.,
In?uence of di?erent preservation treatments on the volatile fraction of desalted cod,
Food Chem., 2006, 98, 3, 473-482, https://doi.org/10.1016/j.foodchem.2005.06.021
. [all data]
Chung, Yung, et al., 2002
Chung, H.-Y.; Yung, I.K.S.; Ma, W.C.J.; Kim, J.-S.,
Analysis of volatile components in frozen and dried scallops (Patinopecten yessoensis) by gas chromatography/mass spectrometry,
Food Res. Int., 2002, 35, 1, 43-53, https://doi.org/10.1016/S0963-9969(01)00107-7
. [all data]
Chung, Yung, et al., 2001
Chung, H.Y.; Yung, I.K.S.; Kim, J.-S.,
Comparison of volatile components in dried scallops (Chlamys farreri and Patinopecten yessoensis) prepared by boiling and steaming methods,
J. Agric. Food Chem., 2001, 49, 1, 192-202, https://doi.org/10.1021/jf000692a
. [all data]
Beauchene, Grua-Priol, et al., 2000
Beauchene, D.; Grua-Priol, J.; Lamer, T.; Demaimay, M.; Quemeneur, F.,
Concentration by pervaporation of aroma compounds from Fucus serratus,
J. Sci. Food Agric., 2000, 75, 451-458. [all data]
Iwaoka, Hagi, et al., 1994
Iwaoka, W.; Hagi, Y.; Umano, K.; Shibamoto, T.,
Volatile chemicals identified in fresh and cooked breadfruit,
J. Agric. Food Chem., 1994, 42, 4, 975-976, https://doi.org/10.1021/jf00040a026
. [all data]
Fröhlich, Duque, et al., 1989
Fröhlich, O.; Duque, C.; Schreier, P.,
Volatile constituents of curuba (Passiflora mollissima) fruit,
J. Agric. Food Chem., 1989, 37, 2, 421-425, https://doi.org/10.1021/jf00086a033
. [all data]
Kurdina, Markovich, et al., 1969
Kurdina, Z.G.; Markovich, V.E.; Sakharov, V.M.,
Gas chromatography of cyclic O-containing compounds
in Gas chromatography, Issue # 10, NIITEKhim, Moscow, 1969, 128-133. [all data]
Anker, Jurs, et al., 1990
Anker, L.S.; Jurs, P.C.; Edwards, P.A.,
Quantitative structure-retention relationship studies of odor-active aliphatic compounds with oxygen-containing functional groups,
Anal. Chem., 1990, 62, 24, 2676-2684, https://doi.org/10.1021/ac00223a006
. [all data]
Vinogradov, 2004
Vinogradov, B.A.,
Production, composition, properties and application of essential oils, 2004, retrieved from http://viness.narod.ru. [all data]
Waggott and Davies, 1984
Waggott, A.; Davies, I.W.,
Identification of organic pollutants using linear temperature programmed retention indices (LTPRIs) - Part II, 1984, retrieved from http://dwi.defra.gov.uk/research/completed-research/reports/dwi0383.pdf. [all data]
Wierda R.L., Fletcher G., et al., 2006
Wierda R.L.; Fletcher G.; Xu L.; Dufour J.P.,
Analysis of volatile compounds as spoilage indicators in fresh king salmon (Oncorhynchus tshawytscha) during storage using SPME-GC-MS,
J. Agric. Food Chem., 2006, 54, 22, 8480-8490, https://doi.org/10.1021/jf061377c
. [all data]
Fu, Yoon, et al., 2002
Fu, S.-G.; Yoon, Y.; Basemore, R.,
Aroma-actie components in fermented bamboo shoots,
J. Agric. Food Chem., 2002, 50, 3, 549-554, https://doi.org/10.1021/jf010883t
. [all data]
Fukami, Ishiyama, et al., 2002
Fukami, K.; Ishiyama, S.; Yaguramaki, H.; Masuzawa, T.; Nabeta, Y.; Endo, K.; Shimoda, M.,
Identification of distinctive volatile compounds in fish sauce,
J. Agric. Food Chem., 2002, 50, 19, 5412-5416, https://doi.org/10.1021/jf020405y
. [all data]
Umano, Nakahara, et al., 1999
Umano, K.; Nakahara, K.; Shoji, A.; Shibamoto, T.,
Aroma chemicals isolated and identified from leaves of aloe arborescens Mill. Var. natalensis Berger,
J. Agric. Food Chem., 1999, 47, 9, 3702-3705, https://doi.org/10.1021/jf990116i
. [all data]
Mihara, Tateba, et al., 1988
Mihara, S.; Tateba, H.; Nishimura, O.; Machii, Y.; Kishino, K.,
The volatile components of Chinese quince (Pseudocydonia sinensis Schneid)
in Flavors and Fragrances: A World Perspective. Proceedings of the 10th International Congress of Essential Oils, Fragrances and Flavors, Lawrence,B.M.; Mookherjee,B.D.; Willis,B.J., ed(s)., Elsevier, New York, 1988, 537-550. [all data]
Mihara, Tateba, et al., 1987
Mihara, S.; Tateba, H.; Nishimura, O.; Machii, Y.; Kishino, K.,
Volatile components of Chinese quince (Pseudocydonia sinensis Schneid),
J. Agric. Food Chem., 1987, 35, 4, 532-537, https://doi.org/10.1021/jf00076a023
. [all data]
Sampaio, Garruti, et al., 2011
Sampaio, K.S.; Garruti, D.S.; Franco, M.R.B.; Janzantti, N.S.; Da Silva, M.A.AP.,
Aroma volatiles recovered in the water phase of cashew apple (Anacardium occidentale L.) juice during concentration,
J. Sci. Food Agric., 2011, 91, 10, 1801-1809, https://doi.org/10.1002/jsfa.4385
. [all data]
Yongsheng, Hua, et al., 2008
Yongsheng, T.; Hua, L.; Hua, W.; Li, Z.,
Volatile composition of young Cabernet Savignon red wine from Changli Counti (China),
J. Food Composition and Analysis, 2008, 21, 8, 689-694, https://doi.org/10.1016/j.jfca.2008.05.007
. [all data]
Quijano and Pino, 2006
Quijano, C.E.; Pino, J.A.,
Changes in volatile constituents during the ripening of cocona (Solanum sessiliflorum Dunal) fruit,
Revista CENIC Ciencias Quimicas, 2006, 37, 3, 133-136. [all data]
Piveteau, le Guen, et al., 2000
Piveteau, F.; le Guen, S.; Gandemer, G.; Baud, J.-P.; Demaimay, M.,
Aroma of fresh oysters Crassostrea gigas: composition and aroma notes,
J. Agric. Food Chem., 2000, 48, 10, 4851-4857, https://doi.org/10.1021/jf991394k
. [all data]
Peng, Yang, et al., 1991, 2
Peng, C.T.; Yang, Z.C.; Ding, S.F.,
Prediction of rentention idexes. II. Structure-retention index relationship on polar columns,
J. Chromatogr., 1991, 586, 1, 85-112, https://doi.org/10.1016/0021-9673(91)80028-F
. [all data]