1,3-Cyclopentadiene, 1-methyl-
- Formula: C6H8
- Molecular weight: 80.1277
- IUPAC Standard InChIKey: NFWSQSCIDYBUOU-UHFFFAOYSA-N
- CAS Registry Number: 96-39-9
- Chemical structure:
View 3d structure (requires JavaScript / HTML 5) - Other names: 1-Methyl-1,3-cyclopentadiene; 1-Methylcyclopentadiene; l,3-Cyclopentadiene,1-methyl-

Phase change data

Data compiled by: Thermodynamics Research Center, NIST Boulder Laboratories, Chris Muzny director
Quantity | Value | Units | Method | Reference | Comment |
---|---|---|---|---|---|
Ttriple | 130.2 | K | N/A | Parks and Huffman, 1931 | Uncertainty assigned by TRC = 0.1 K |

Gas phase ion energetics data

Data evaluated as indicated in comments:
L - Sharon G. Lias
Data compiled as indicated in comments:
LLK - Sharon G. Lias, Rhoda D. Levin, and Sherif A. Kafafi
RDSH - Henry M. Rosenstock, Keith Draxl, Bruce W. Steiner, and John T. Herron
Quantity | Value | Units | Method | Reference | Comment |
---|---|---|---|---|---|
IE (evaluated) | 8.40 ± 0.02 | eV | N/A | N/A | L |
Ionization energy determinations
IE (eV) | Method | Reference | Comment |
---|---|---|---|
8.40 ± 0.02 | PE | Bieri, Burger, et al., 1977 | LLK |
8.43 ± 0.05 | EI | Meyer and Harrison, 1964 | RDSH |
8.4 | PE | Cradock, Ebsworth, et al., 1975 | Vertical value; LLK |
8.40 | PE | Cradock, Findlay, et al., 1974 | Vertical value; LLK |

Kovats' RI, non-polar column, isothermal

Column type | Active phase | Temperature (C) | I | Reference | Comment |
---|---|---|---|---|---|
Capillary | OV-101 | 100. | 644. | Diez, Guillen, et al., 1990 | N2; Column length: 25. m; Column diameter: 0.23 mm |
Capillary | OV-101 | 80. | 642. | Diez, Guillen, et al., 1990 | N2; Column length: 25. m; Column diameter: 0.23 mm |
Capillary | Squalane | 100. | 630. | Diez, Guillen, et al., 1990 | N2; Column length: 45. m; Column diameter: 0.5 mm |
Capillary | Squalane | 80. | 627.5 | Diez, Guillen, et al., 1990 | N2; Column length: 45. m; Column diameter: 0.5 mm |
Capillary | SE-54 | 100. | 653.8 | Diez, Guillen, et al., 1990 | N2; Column length: 25. m; Column diameter: 0.22 mm |
Capillary | SE-54 | 80. | 652.8 | Diez, Guillen, et al., 1990 | N2; Column length: 25. m; Column diameter: 0.22 mm |
Capillary | BP-1 | 100. | 644. | Bermejo, Blanco, et al., 1987 | N2; Column length: 12. m; Column diameter: 0.22 mm |
Capillary | BP-1 | 80. | 641. | Bermejo, Blanco, et al., 1987 | N2; Column length: 12. m; Column diameter: 0.22 mm |
Capillary | OV-101 | 100. | 644. | Bermejo, Blanco, et al., 1987 | N2; Column length: 25. m; Column diameter: 0.23 mm |
Capillary | OV-101 | 80. | 642. | Bermejo, Blanco, et al., 1987 | N2; Column length: 25. m; Column diameter: 0.23 mm |
Capillary | Squalane | 64. | 626. | Sojak, Ruman, et al., 1987 | 50. m/0.25 mm/0.25 μm, H2 |
Capillary | Squalane | 50. | 626.3 | Bajus, Veselý, et al., 1979 | Column length: 100. m; Column diameter: 0.25 mm |
Packed | Squalane | 27. | 623. | Hively and Hinton, 1968 | He, Chromosorb P; Column length: 15. m; Column diameter: 0.25 mm |
Packed | Squalane | 49. | 626. | Hively and Hinton, 1968 | He, Chromosorb P; Column length: 15. m; Column diameter: 0.25 mm |
Packed | Squalane | 67. | 628. | Hively and Hinton, 1968 | He, Chromosorb P; Column length: 15. m; Column diameter: 0.25 mm |

Kovats' RI, polar column, isothermal

Column type | Active phase | Temperature (C) | I | Reference | Comment |
---|---|---|---|---|---|
Capillary | Carbowax 20M | 64. | 844.5 | Sojak, Ruman, et al., 1987 | 50. m/0.25 mm/0.25 μm, H2 |

Normal alkane RI, non-polar column, custom temperature program

Column type | Active phase | I | Reference | Comment |
---|---|---|---|---|
Capillary | Squalane | 626. | Chen, 2008 | Program: not specified |

References

Parks and Huffman, 1931
Parks, G.S.; Huffman, H.M.,
Some fusion and transition data for hydrocarbons,
Ind. Eng. Chem., 1931, 23, 1138-9. [all data]
Bieri, Burger, et al., 1977
Bieri, G.; Burger, F.; Heilbronner, E.; Maier, J.P.,
Valence ionization enrgies of hydrocarbons,
Helv. Chim. Acta, 1977, 60, 2213. [all data]
Meyer and Harrison, 1964
Meyer, F.; Harrison, A.G.,
Ionization potentials of methyl-substituted benzenes and cyclopentadienes,
Can. J. Chem., 1964, 42, 2256. [all data]
Cradock, Ebsworth, et al., 1975
Cradock, S.; Ebsworth, E.A.V.; Moretto, H.; Rankin, D.W.H.,
Photoelectron spectra and fluxional behaviour in some σ-cyclopentadienes,
J. Chem. Soc. Dalton Trans., 1975, 390. [all data]
Cradock, Findlay, et al., 1974
Cradock, S.; Findlay, R.H.; Palmer, M.H.,
Bonding in methyl- and silyl-cyclopentadiene compounds: a study by photoelectron spectroscopy ab initio molecular-orbital calculations,
J. Chem. Soc. Dalton Trans., 1974, 1650. [all data]
Diez, Guillen, et al., 1990
Diez, M.A.; Guillen, M.D.; Blanco, C.G.; Bermejo, J.,
Chromatographic study of methylcyclopentadiene dimers and iso-dimers and determination of their boiling points,
J. Chromatogr., 1990, 508, 363-374, https://doi.org/10.1016/S0021-9673(00)91279-2
. [all data]
Bermejo, Blanco, et al., 1987
Bermejo, J.; Blanco, C.G.; Diez, M.A.; Guillén, M.D.,
Kováts retention indices of selected mono and polycyclic olefins,
J. Hi. Res. Chromatogr. Chromatogr. Comm., 1987, 10, 8, 461-463, https://doi.org/10.1002/jhrc.1240100809
. [all data]
Sojak, Ruman, et al., 1987
Sojak, L.; Ruman, J.; Janak, J.,
Characterization of Monoalkylcyclopentadiens by Retention-Structure Correlation in Capillary Gas Chromatography,
J. Chromatogr., 1987, 391, 79-87, https://doi.org/10.1016/S0021-9673(01)94306-7
. [all data]
Bajus, Veselý, et al., 1979
Bajus, M.; Veselý, V.; Leclercq, P.A.; Rijks, J.A.,
Steam cracking of hydrocarbons. 2. Pyrolysis of methylcyclohexane,
Ind. Eng. Chem. Prod. Res. Dev., 1979, 18, 2, 135-142, https://doi.org/10.1021/i360070a012
. [all data]
Hively and Hinton, 1968
Hively, R.A.; Hinton, R.E.,
Variation of the retention index with temperature on squalane substrates,
J. Gas Chromatogr., 1968, 6, 4, 203-217, https://doi.org/10.1093/chromsci/6.4.203
. [all data]
Chen, 2008
Chen, H.-F.,
Quantitative prediction of gas chromatography retention indices with support vector machines, radial basis neutral networks and multiple linear regression,
Anal. Chim. Acta, 2008, 609, 1, 24-36, https://doi.org/10.1016/j.aca.2008.01.003
. [all data]