1,3-Cyclopentadiene, 5-methyl-
- Formula: C6H8
- Molecular weight: 80.1277
- IUPAC Standard InChIKey: QVRBGKYLLCLCHL-UHFFFAOYSA-N
- CAS Registry Number: 96-38-8
- Chemical structure:
View 3d structure (requires JavaScript / HTML 5) - Other names: 5-Methyl-1,3-cyclopentadiene; 5-Methylcyclopentadiene

Gas phase ion energetics data

Data compiled as indicated in comments:
LLK - Sharon G. Lias, Rhoda D. Levin, and Sherif A. Kafafi
RDSH - Henry M. Rosenstock, Keith Draxl, Bruce W. Steiner, and John T. Herron
Ionization energy determinations
IE (eV) | Method | Reference | Comment |
---|---|---|---|
8.45 ± 0.02 | PE | Bieri, Burger, et al., 1977 | LLK |
Appearance energy determinations
Ion | AE (eV) | Other Products | Method | Reference | Comment |
---|---|---|---|---|---|
C5H5+ | 13.5 | CH3 | EI | Harrison, Haynes, et al., 1965 | RDSH |
C6H5+ | 14.0 | H2+H | EI | Harrison, Haynes, et al., 1965 | RDSH |
C6H7+ | 11.3 | H | EI | Harrison, Haynes, et al., 1965 | RDSH |

Kovats' RI, non-polar column, isothermal

Column type | Active phase | Temperature (C) | I | Reference | Comment |
---|---|---|---|---|---|
Capillary | Squalane | 64. | 645. | Sojak, Ruman, et al., 1987 | 50. m/0.25 mm/0.25 μm, H2 |
Capillary | SE-30 | 130. | 645. | Bredael, 1982 | Column length: 100. m; Column diameter: 0.5 mm |
Capillary | SE-30 | 80. | 639. | Bredael, 1982 | Column length: 100. m; Column diameter: 0.5 mm |

Kovats' RI, polar column, isothermal

Column type | Active phase | Temperature (C) | I | Reference | Comment |
---|---|---|---|---|---|
Capillary | Carbowax 20M | 64. | 870.4 | Sojak, Ruman, et al., 1987 | 50. m/0.25 mm/0.25 μm, H2 |

Normal alkane RI, non-polar column, custom temperature program

Column type | Active phase | I | Reference | Comment |
---|---|---|---|---|
Capillary | Squalane | 639. | Chen, 2008 | Program: not specified |
Capillary | Squalane | 646. | Chen, 2008 | Program: not specified |

References

Bieri, Burger, et al., 1977
Bieri, G.; Burger, F.; Heilbronner, E.; Maier, J.P.,
Valence ionization enrgies of hydrocarbons,
Helv. Chim. Acta, 1977, 60, 2213. [all data]
Harrison, Haynes, et al., 1965
Harrison, A.G.; Haynes, P.; McLean, S.; Meyer, F.,
The mass spectra of methyl-substituted cyclopentadienes,
J. Am. Chem. Soc., 1965, 87, 5099. [all data]
Sojak, Ruman, et al., 1987
Sojak, L.; Ruman, J.; Janak, J.,
Characterization of Monoalkylcyclopentadiens by Retention-Structure Correlation in Capillary Gas Chromatography,
J. Chromatogr., 1987, 391, 79-87, https://doi.org/10.1016/S0021-9673(01)94306-7
. [all data]
Bredael, 1982
Bredael, P.,
Retention indices of hydrocarbons on SE-30,
J. Hi. Res. Chromatogr. Chromatogr. Comm., 1982, 5, 6, 325-328, https://doi.org/10.1002/jhrc.1240050610
. [all data]
Chen, 2008
Chen, H.-F.,
Quantitative prediction of gas chromatography retention indices with support vector machines, radial basis neutral networks and multiple linear regression,
Anal. Chim. Acta, 2008, 609, 1, 24-36, https://doi.org/10.1016/j.aca.2008.01.003
. [all data]