2-Propenoic acid, methyl ester
- Formula: C4H6O2
- Molecular weight: 86.0892
- IUPAC Standard InChIKey: BAPJBEWLBFYGME-UHFFFAOYSA-N
- CAS Registry Number: 96-33-3
- Chemical structure:
View 3d structure (requires JavaScript / HTML 5) - Other names: Acrylic acid methyl ester; Methoxycarbonylethylene; Methyl acrylate; Methyl propenoate; Methyl 2-propenoate; CH2=CHCOOCH3; Methyl propenate; Acrylate de methyle; Acrylsaeuremethylester; Methyl-acrylat; Methylacrylaat; Metilacrilato; Curithane 103; Methylester kyseliny akrylove; UN 1919; Methyl prop-2-enoate; Methyl ester of 2-propenoic acid; Methyl ester acrylic acid; NSC 24146

Gas phase thermochemistry data

Data compiled by: Hussein Y. Afeefy, Joel F. Liebman, and Stephen E. Stein
Quantity | Value | Units | Method | Reference | Comment |
---|---|---|---|---|---|
ΔfH°gas | -333.0 | kJ/mol | Ccr | Hall and Baldt, 1971 |

Condensed phase thermochemistry data

Data compiled as indicated in comments:
ALS - Hussein Y. Afeefy, Joel F. Liebman, and Stephen E. Stein
DH - Eugene S. Domalski and Elizabeth D. Hearing
Quantity | Value | Units | Method | Reference | Comment |
---|---|---|---|---|---|
ΔfH°liquid | -362.2 | kJ/mol | Ccr | Hall and Baldt, 1971 | ALS |
Quantity | Value | Units | Method | Reference | Comment |
ΔcH°liquid | -2069.4 ± 0.67 | kJ/mol | Ccr | Hall and Baldt, 1971 | Corresponding ΔfHºliquid = -362.2 kJ/mol (simple calculation by NIST; no Washburn corrections); ALS |
Constant pressure heat capacity of liquid
Cp,liquid (J/mol*K) | Temperature (K) | Reference | Comment |
---|---|---|---|
172.3 | 298.15 | Karabaev, Saidov, et al., 1985 | T = 90 to 290 K. Cp(c) = 285.21 + 5.32T J/kg*K (103 to 175 K; Cp(liq) = 1568.62 + 1.45T (197.5 to 290 K). Cp data calculated from equation.; DH |
161.5 | 298.15 | Fuchs, 1979 | DH |
133.4 | 297. | Hall and Baldt, 1971 | DH |

Phase change data

Data compiled as indicated in comments:
BS - Robert L. Brown and Stephen E. Stein
TRC - Thermodynamics Research Center, NIST Boulder Laboratories, Chris Muzny director
DH - Eugene S. Domalski and Elizabeth D. Hearing
ALS - Hussein Y. Afeefy, Joel F. Liebman, and Stephen E. Stein
DRB - Donald R. Burgess, Jr.
AC - William E. Acree, Jr., James S. Chickos
Quantity | Value | Units | Method | Reference | Comment |
---|---|---|---|---|---|
Tboil | 353.7 | K | N/A | Weast and Grasselli, 1989 | BS |
Tboil | 353. | K | N/A | American Tokyo Kasei, 1988 | BS |
Tboil | 354.1 | K | N/A | Anonymous, 1955 | Uncertainty assigned by TRC = 0.6 K; TRC |
Tboil | 353. | K | N/A | Rehberg and Fisher, 1944 | Uncertainty assigned by TRC = 2. K; TRC |
Quantity | Value | Units | Method | Reference | Comment |
Tfus | 197.5 | K | N/A | Karabaev, Saidov, et al., 1985 | DH |
Tfus | 197.5 | K | N/A | Karabaev, Abduzhaminov, et al., 1985 | Uncertainty assigned by TRC = 0.2 K; TRC |
Quantity | Value | Units | Method | Reference | Comment |
ΔvapH° | 29.2 | kJ/mol | V | Hall and Baldt, 1971 | ALS |
ΔvapH° | 29.2 | kJ/mol | N/A | Hall and Baldt, 1971 | DRB |
Enthalpy of vaporization
ΔvapH (kJ/mol) | Temperature (K) | Method | Reference | Comment |
---|---|---|---|---|
34.2 | 331. | A | Stephenson and Malanowski, 1987 | Based on data from 316. to 354. K.; AC |
28.8 | 314. | BG | Baldt and Hall, 1971 | Based on data from 299. to 337. K.; AC |
38. | 244. | N/A | Stull, 1947 | Based on data from 229. to 353. K.; AC |
Antoine Equation Parameters
log10(P) = A − (B / (T + C))
P = vapor pressure (bar)
T = temperature (K)
View plot Requires a JavaScript / HTML 5 canvas capable browser.
Temperature (K) | A | B | C | Reference | Comment |
---|---|---|---|---|---|
229.5 to 353.3 | 4.32327 | 1338.663 | -43.516 | Stull, 1947 | Coefficents calculated by NIST from author's data. |
Enthalpy of fusion
ΔfusH (kJ/mol) | Temperature (K) | Reference | Comment |
---|---|---|---|
9.729 | 197.5 | Karabaev, Abduzhaminov, et al., 1985, 2 | DH |
9.73 | 197.5 | Domalski and Hearing, 1996 | AC |
Entropy of fusion
ΔfusS (J/mol*K) | Temperature (K) | Reference | Comment |
---|---|---|---|
49.26 | 197.5 | Karabaev, Abduzhaminov, et al., 1985, 2 | DH |

Reaction thermochemistry data

Data compiled by: Hussein Y. Afeefy, Joel F. Liebman, and Stephen E. Stein
Individual Reactions
By formula: H2 + C4H6O2 = C4H8O2
Quantity | Value | Units | Method | Reference | Comment |
---|---|---|---|---|---|
ΔrH° | -501.2 | kJ/mol | Chyd | Veselova and Sul'man, 1980 | liquid phase |

Gas phase ion energetics data

Data evaluated as indicated in comments:
HL - Edward P. Hunter and Sharon G. Lias
Data compiled as indicated in comments:
LLK - Sharon G. Lias, Rhoda D. Levin, and Sherif A. Kafafi
Quantity | Value | Units | Method | Reference | Comment |
---|---|---|---|---|---|
Proton affinity (review) | 825.8 | kJ/mol | N/A | Hunter and Lias, 1998 | HL |
Quantity | Value | Units | Method | Reference | Comment |
Gas basicity | 794.8 | kJ/mol | N/A | Hunter and Lias, 1998 | HL |
Ionization energy determinations
IE (eV) | Method | Reference | Comment |
---|---|---|---|
9.9 | PE | Van Dam and Oskam, 1978 | LLK |
10.74 | PE | Van Dam and Oskam, 1978 | Vertical value; LLK |
10.72 | PE | Sustmann and Trill, 1972 | Vertical value; LLK |

Kovats' RI, non-polar column, isothermal

Column type | Active phase | Temperature (C) | I | Reference | Comment |
---|---|---|---|---|---|
Capillary | OV-101 | 100. | 597. | Horna, Táborský, et al., 1985 | N2; Column length: 19. m; Column diameter: 0.28 mm |
Capillary | OV-101 | 120. | 598. | Horna, Táborský, et al., 1985, 2 | N2; Column length: 19. m; Column diameter: 0.28 mm |
Capillary | OV-101 | 80. | 602. | Horna, Táborský, et al., 1985, 2 | N2; Column length: 19. m; Column diameter: 0.28 mm |
Packed | SE-30 | 150. | 595. | Tiess, 1984 | Ar, Gas Chrom Q (80-100 mesh); Column length: 3. m |
Packed | Apiezon L | 120. | 568. | Bogoslovsky, Anvaer, et al., 1978 | Celite 545 |
Packed | Apiezon L | 160. | 574. | Bogoslovsky, Anvaer, et al., 1978 | Celite 545 |
Packed | SE-30 | 150. | 603. | Ashes and Haken, 1975 | He, Celatom silanized (62-72 mesh); Column length: 3.7 m |
Packed | SE-30 | 150. | 569. | Allen and Haken, 1970 | Celite 560 silanized; Column length: 3.7 m |
Packed | SE-30 | 150. | 569. | Germaine and Haken, 1969 | Celite 560; Column length: 3.7 m |

Kovats' RI, polar column, isothermal

Column type | Active phase | Temperature (C) | I | Reference | Comment |
---|---|---|---|---|---|
Capillary | SP-1000 | 100. | 940. | Horna, Táborský, et al., 1985 | N2; Column length: 46. m; Column diameter: 0.23 mm |
Capillary | SP-1000 | 120. | 941. | Horna, Táborský, et al., 1985, 2 | N2; Column length: 46. m; Column diameter: 0.23 mm |
Capillary | SP-1000 | 80. | 937. | Horna, Táborský, et al., 1985, 2 | N2; Column length: 46. m; Column diameter: 0.23 mm |

Van Den Dool and Kratz RI, non-polar column, temperature ramp

Column type | Active phase | I | Reference | Comment |
---|---|---|---|---|
Packed | SE-30 | 625. | Fischer and Kusch, 1990 | Chromosorb W AW (80-100 mesh), 5. K/min; Column length: 1.5 m; Tstart: 60. C; Tend: 280. C |

Van Den Dool and Kratz RI, non-polar column, custom temperature program

Column type | Active phase | I | Reference | Comment |
---|---|---|---|---|
Packed | SE-30 | 591. | Peng, Ding, et al., 1988 | Supelcoport; Chromosorb; Column length: 3.05 m; Program: 40C(5min) => 10C/min => 200C or 250C (60min) |

Normal alkane RI, non-polar column, isothermal

Column type | Active phase | Temperature (C) | I | Reference | Comment |
---|---|---|---|---|---|
Capillary | OV-101 | 120. | 607. | Blazso, Ujszaszi, et al., 1980 | Column length: 20. m; Column diameter: 0.23 mm |
Capillary | OV-101 | 160. | 599. | Blazso, Ujszaszi, et al., 1980 | Column length: 20. m; Column diameter: 0.23 mm |
Packed | DC-400 | 150. | 566. | Anderson, 1968 | Helium, Gas-Pak (60-80 mesh); Column length: 3.0 m |

Normal alkane RI, non-polar column, temperature ramp

Column type | Active phase | I | Reference | Comment |
---|---|---|---|---|
Capillary | MDN-5 | 607. | van Loon, Linssen, et al., 2005 | 60. m/0.25 mm/0.25 μm, He, 40. C @ 4. min, 4. K/min, 270. C @ 5. min |

Normal alkane RI, non-polar column, custom temperature program

Column type | Active phase | I | Reference | Comment |
---|---|---|---|---|
Capillary | SE-30 | 625. | Vinogradov, 2004 | Program: not specified |

Normal alkane RI, polar column, custom temperature program

Column type | Active phase | I | Reference | Comment |
---|---|---|---|---|
Capillary | Carbowax 20M | 938. | Vinogradov, 2004 | Program: not specified |
Capillary | Carbowax 400, Carbowax 20M, Carbowax 1540, Carbowax 4000, Superox 06, PEG 20M, etc. | 938. | Waggott and Davies, 1984 | Hydrogen; Column length: 50. m; Column diameter: 0.32 mm; Program: not specified |

References

Hall and Baldt, 1971
Hall, H.K., Jr.; Baldt, J.H.,
Thermochemistry of strained-ring bridgehead nitriles and esters,
J. Am. Chem. Soc., 1971, 93, 140-145. [all data]
Karabaev, Saidov, et al., 1985
Karabaev, M.; Saidov, A.A.; Abduzhaminov, T.P.; Kenisarin, M.M.,
Heat capacity and molecular kinetic processes of condensed phase acrylates and methacrylates, Izv. Akad. Nauk UzSSR,
Ser. Fiz.-Math., 1985, (6), 51-54. [all data]
Fuchs, 1979
Fuchs, R.,
Heat capacities of some liquid aliphatic, alicyclic, and aromatic esters at 298.15 K,
J. Chem. Thermodyn., 1979, 11, 959-961. [all data]
Weast and Grasselli, 1989
CRC Handbook of Data on Organic Compounds, 2nd Editon, Weast,R.C and Grasselli, J.G., ed(s)., CRC Press, Inc., Boca Raton, FL, 1989, 1. [all data]
American Tokyo Kasei, 1988
American Tokyo Kasei,
TCI American Organic Chemical 88/89 Catalog, American Tokyo Kasei, Portland, OR, 1988, 1610. [all data]
Anonymous, 1955
Anonymous, R.,
, Am. Pet. Inst. Res. Proj. 45, Tech. Rep. 14, No. 1, Ohio State Univ., 1955. [all data]
Rehberg and Fisher, 1944
Rehberg, C.E.; Fisher, C.H.,
Preparatioon and Properties of the n-Alkyl Acrylates,
J. Am. Chem. Soc., 1944, 66, 1203-7. [all data]
Karabaev, Abduzhaminov, et al., 1985
Karabaev, M.K.; Abduzhaminov, T.P.; Kenisarin, M.M.; Saidov, A.A.,
Thermodynamics of the crystal-liquid phase transition in acrylates and methacrylates.,
Izv. Akad. Nauk Uzb. SSR Ser., Fiz-Mat. Nauk, 1985, 1985, No. 5, 74-7. [all data]
Stephenson and Malanowski, 1987
Stephenson, Richard M.; Malanowski, Stanislaw,
Handbook of the Thermodynamics of Organic Compounds, 1987, https://doi.org/10.1007/978-94-009-3173-2
. [all data]
Baldt and Hall, 1971
Baldt, J.H.; Hall, H.K.K., Jr.,
Thermochemistry of strained-ring bridgehead nitriles and esters,
J. Am. Chem. Soc., 1971, 93, 140-145. [all data]
Stull, 1947
Stull, Daniel R.,
Vapor Pressure of Pure Substances. Organic and Inorganic Compounds,
Ind. Eng. Chem., 1947, 39, 4, 517-540, https://doi.org/10.1021/ie50448a022
. [all data]
Karabaev, Abduzhaminov, et al., 1985, 2
Karabaev, M.K.; Abduzhaminov, T.P.; Kenisarin, M.M.; Saidov, A.A.,
Thermodynamics of the crystal-liquid phase transition in acrylates and methacrylates, Izv. Akad. Nauk Uzb. SSR,
Ser. Fiz.-Mat. Nauk, 1985, (5), 74-77. [all data]
Domalski and Hearing, 1996
Domalski, Eugene S.; Hearing, Elizabeth D.,
Heat Capacities and Entropies of Organic Compounds in the Condensed Phase. Volume III,
J. Phys. Chem. Ref. Data, 1996, 25, 1, 1, https://doi.org/10.1063/1.555985
. [all data]
Veselova and Sul'man, 1980
Veselova, M.E.; Sul'man, E.M.,
Effect of the chemical structure of α,β-unsaturated esters and ketones on the selectivity of their hydrogenation,
Svoistva Veshchestv i Stroenie Molekul, Kalinin, 1980, 140-143. [all data]
Hunter and Lias, 1998
Hunter, E.P.; Lias, S.G.,
Evaluated Gas Phase Basicities and Proton Affinities of Molecules: An Update,
J. Phys. Chem. Ref. Data, 1998, 27, 3, 413-656, https://doi.org/10.1063/1.556018
. [all data]
Van Dam and Oskam, 1978
Van Dam, H.; Oskam, A.,
He(I) and He(II) photoelectron spectra of some substituted ethylenes,
J. Electron Spectrosc. Relat. Phenom., 1978, 13, 273. [all data]
Sustmann and Trill, 1972
Sustmann, R.; Trill, H.,
Photoelektronenspektroskopische Bestimmung von Substituenten-Effekten. II. α,β-ungesattigte Carbonester,
Tetrahedron Lett., 1972, 42, 4271. [all data]